[
  {
    "id": "dde7709d-437d-4445-b477-7e49d9f2653a",
    "name": {
      "name": "Bonnat Chocolates",
      "chocolates": [
        {
          "id": 3,
          "name": "Chocolat Bonnat",
          "price": 580,
          "chocolateKind": "White",
          "chocolateType": "Bar",
          "weight": 290,
          "description": "Creamy and smooth",
          "image": "chocolate1.png",
          "status": "In stock",
          "quantity": 9600
        },
        {
          "id": 4,
          "name": "Bonnat Praline Noisette",
          "price": 790,
          "chocolateKind": "Dark",
          "chocolateType": "Pralines",
          "weight": 300,
          "description": "55% cocoa",
          "image": "chocolate2.png",
          "status": "In stock",
          "quantity": 817
        },
        {
          "id": 7,
          "name": "Nova Čokolada",
          "price": 550,
          "chocolateKind": "Milk",
          "chocolateType": "Bar",
          "weight": 150,
          "description": "Delicious milk chocolate",
          "image": "chocolate3.png",
          "status": "In stock",
          "quantity": 45
        }
      ],
      "openingHours": "10:00-16:00",
      "workStatus": "Closed",
      "location": {
        "street": "Rue du Faubourg Saint-Honoré 75008",
        "city": "Paris",
        "state": "France",
        "latitude": 48.870848,
        "longitude": 2.31114
      },
      "logo": "factory2.png",
      "rating": 8.8
    }
  },
  {
    "id": "cbb5d437-0987-4eaf-9df8-f9fba6f21b73",
    "name": {
      "name": "Milka Factory",
      "chocolates": [
        {
          "id": 8,
          "name": "Milka White Bubble",
          "price": 400,
          "chocolateKind": "White",
          "chocolateType": "Bar",
          "weight": 250,
          "description": "Airy white chocolate bubbles",
          "image": "chocolate8.png",
          "status": "In stock",
          "quantity": 4980
        },
        {
          "id": 9,
          "name": "Milka Dark Bubble",
          "price": 420,
          "chocolateKind": "Dark",
          "chocolateType": "Bar",
          "weight": 250,
          "description": "Rich dark chocolate bubbles",
          "image": "chocolate4.png",
          "status": "In stock",
          "quantity": 3994
        },
        {
          "id": 10,
          "name": "Milka Yogurt",
          "price": 380,
          "chocolateKind": "Milk",
          "chocolateType": "Bar",
          "weight": 300,
          "description": "Delicious milk chocolate with yogurt filling",
          "image": "chocolate9.png",
          "status": "In stock",
          "quantity": 6000
        },
        {
          "id": 11,
          "name": "Milka Strawberry",
          "price": 390,
          "chocolateKind": "Milk",
          "chocolateType": "Bar",
          "weight": 300,
          "description": "Sweet strawberry filling with milk chocolate",
          "image": "chocolate6.png",
          "status": "In stock",
          "quantity": 5500
        },
        {
          "id": 12,
          "name": "Milka Lila Pause",
          "price": 450,
          "chocolateKind": "Milk",
          "chocolateType": "Bar",
          "weight": 280,
          "description": "Crunchy and smooth chocolate",
          "image": "chocolate5.png",
          "status": "In stock",
          "quantity": 3000
        },
        {
          "id": 13,
          "name": "Milka Original",
          "price": 350,
          "chocolateKind": "Milk",
          "chocolateType": "Bar",
          "weight": 200,
          "description": "Classic Milka taste",
          "image": "chocolate7.png",
          "status": "In stock",
          "quantity": 7000
        }
      ],
      "openingHours": "09:00-17:00",
      "workStatus": "Open",
      "location": {
        "street": "Schokoladenfabrik Straße 1",
        "city": "Bludenz",
        "state": "Austria",
        "latitude": 47.153,
        "longitude": 9.816
      },
      "logo": "factory3.png",
      "rating": 9.2
    }
  },
  {
    "id": "bfa5f6c1-45c6-4af6-8a7e-3415d9fead5a",
    "name": {
      "name": "Najlepše Želje",
      "chocolates": [
        {
          "id": 14,
          "name": "Najlepše Želje Kapri",
          "price": 350,
          "chocolateKind": "Milk",
          "chocolateType": "Bar",
          "weight": 200,
          "description": "Delicious milk chocolate with cherry filling",
          "image": "chocolate10.png",
          "status": "In stock",
          "quantity": 4000
        },
        {
          "id": 15,
          "name": "Najlepše Želje Lešnik",
          "price": 380,
          "chocolateKind": "Milk",
          "chocolateType": "Bar",
          "weight": 220,
          "description": "Rich milk chocolate with whole hazelnuts",
          "image": "chocolate12.png",
          "status": "In stock",
          "quantity": 3491
        },
        {
          "id": 16,
          "name": "Najlepše Želje Keks",
          "price": 360,
          "chocolateKind": "Milk",
          "chocolateType": "Bar",
          "weight": 250,
          "description": "Smooth chocolate with crunchy biscuit",
          "image": "chocolate11.png",
          "status": "In stock",
          "quantity": 5000
        }
      ],
      "openingHours": "09:00-18:00",
      "workStatus": "Open",
      "location": {
        "street": "Čokoladna ulica 5",
        "city": "Beograd",
        "state": "Serbia",
        "latitude": 44.7866,
        "longitude": 20.4489
      },
      "logo": "factory4.png",
      "rating": 9
    }
  },
  {
    "id": "abf5c73f-274f-48fc-aebc-f7b9f1d77c94",
    "name": {
      "name": "Kinder Factory",
      "chocolates": [
        {
          "id": 17,
          "name": "Kinder Chocolate",
          "price": 450,
          "chocolateKind": "Milk",
          "chocolateType": "Bar",
          "weight": 100,
          "description": "Smooth milk chocolate with creamy filling",
          "image": "chocolate13.png",
          "status": "In stock",
          "quantity": 6950
        },
        {
          "id": 18,
          "name": "Kinder Bueno",
          "price": 500,
          "chocolateKind": "Milk",
          "chocolateType": "Bar",
          "weight": 110,
          "description": "Crispy wafer with creamy hazelnut filling and milk chocolate",
          "image": "chocolate14.png",
          "status": "In stock",
          "quantity": 7860
        },
        {
          "id": 19,
          "name": "Kinder Surprise",
          "price": 550,
          "chocolateKind": "Milk",
          "chocolateType": "Egg",
          "weight": 60,
          "description": "Milk chocolate egg with a surprise toy inside",
          "image": "chocolate15.png",
          "status": "In stock",
          "quantity": 4990
        }
      ],
      "openingHours": "09:00-17:00",
      "workStatus": "Open",
      "location": {
        "street": "Kinderstraße 10",
        "city": "Frankfurt",
        "state": "Germany",
        "latitude": 50.110924,
        "longitude": 8.682127
      },
      "logo": "factory5.png",
      "rating": 9.5
    }
  },
  {
    "name": {
      "name": "neka fabrika",
      "location": {
        "street": "fabrika",
        "city": "Novi Sad",
        "state": "Bulevar Oslobdjenja",
        "longitude": 10,
        "latitude": 10
      },
      "openingHours": "12:00-23:00",
      "logo": "factory1.jpg",
      "rating": 0,
      "chocolates": [],
      "manager": ""
    },
    "id": "060e9fdf-b435-4d96-af91-0e94b6bb9bd6"
  },
  {
    "name": {
      "name": "sadd",
      "location": {
        "street": "asa",
        "city": "asas",
        "state": "bihbi",
        "longitude": 2,
        "latitude": 22
      },
      "openingHours": "9",
      "logo": "",
      "rating": 0,
      "chocolates": [],
      "manager": ""
    },
    "id": "2d55ebc6-5342-4c70-b8d8-0ae66e833171"
  }
]