{
  "version": "15.0.7",
  "vulnerabilities": [
    {
      "id": "7d3c3d186f1808b637f2ff76103fd7eff359dcd479321fa57bd0c34118d06f52",
      "category": "sast",
      "name": "express_open_redirect",
      "description": "Untrusted user input in redirect() can result in Open Redirect vulnerability.",
      "cve": "index.js:46:express_open_redirect:CWE-601",
      "severity": "High",
      "scanner": {
        "id": "nodejs-scan",
        "name": "NodeJsScan"
      },
      "location": {
        "file": "index.js",
        "start_line": 46,
        "end_line": 46
      },
      "identifiers": [
        {
          "type": "njsscan_rule_type",
          "name": "express_open_redirect",
          "value": "Untrusted user input in redirect() can result in Open Redirect vulnerability."
        },
        {
          "type": "cwe",
          "name": "CWE-601",
          "value": "express_open_redirect"
        }
      ]
    },
    {
      "id": "c20c33a82183e6acd65cb4346033f505ffab83d0c59ad287eace045675f21e6b",
      "category": "sast",
      "name": "express_xss",
      "description": "Untrusted User Input in Response will result in Reflected Cross Site Scripting Vulnerability.",
      "cve": "index.js:28:express_xss:CWE-79",
      "severity": "High",
      "scanner": {
        "id": "nodejs-scan",
        "name": "NodeJsScan"
      },
      "location": {
        "file": "index.js",
        "start_line": 28,
        "end_line": 28
      },
      "identifiers": [
        {
          "type": "njsscan_rule_type",
          "name": "express_xss",
          "value": "Untrusted User Input in Response will result in Reflected Cross Site Scripting Vulnerability."
        },
        {
          "type": "cwe",
          "name": "CWE-79",
          "value": "express_xss"
        }
      ]
    },
    {
      "id": "c0f4b4d29d8b9e59f4e98c7ea0b614ae9138d8ed986a441802b0a12aa0157f97",
      "category": "sast",
      "name": "express_xss",
      "description": "Untrusted User Input in Response will result in Reflected Cross Site Scripting Vulnerability.",
      "cve": "index.js:32:express_xss:CWE-79",
      "severity": "High",
      "scanner": {
        "id": "nodejs-scan",
        "name": "NodeJsScan"
      },
      "location": {
        "file": "index.js",
        "start_line": 32,
        "end_line": 32
      },
      "identifiers": [
        {
          "type": "njsscan_rule_type",
          "name": "express_xss",
          "value": "Untrusted User Input in Response will result in Reflected Cross Site Scripting Vulnerability."
        },
        {
          "type": "cwe",
          "name": "CWE-79",
          "value": "express_xss"
        }
      ]
    },
    {
      "id": "b86b047569d958d42037d5e9c33b3076d4706c55770a09c8f340901f7b17545c",
      "category": "sast",
      "name": "pug_jade_template",
      "description": "The Pug.js/Jade.js template has an unescaped variable. Untrusted user input passed to this variable results in Cross Site Scripting (XSS).",
      "cve": "pug.pug:1:pug_jade_template:CWE-79",
      "severity": "High",
      "scanner": {
        "id": "nodejs-scan",
        "name": "NodeJsScan"
      },
      "location": {
        "file": "pug.pug",
        "start_line": 1,
        "end_line": 1
      },
      "identifiers": [
        {
          "type": "njsscan_rule_type",
          "name": "pug_jade_template",
          "value": "The Pug.js/Jade.js template has an unescaped variable. Untrusted user input passed to this variable results in Cross Site Scripting (XSS)."
        },
        {
          "type": "cwe",
          "name": "CWE-79",
          "value": "pug_jade_template"
        }
      ]
    }
  ],
  "dependency_files": [],
  "scan": {
    "analyzer": {
      "id": "",
      "name": "",
      "vendor": {
        "name": ""
      },
      "version": ""
    },
    "scanner": {
      "id": "",
      "name": "",
      "vendor": {
        "name": ""
      },
      "version": ""
    },
    "type": ""
  }
}