<?xml version="1.0" encoding="UTF-8" standalone="no"?>
<!-- Created with Inkscape (http://www.inkscape.org/) -->

<svg
   version="1.1"
   id="svg2"
   width="341.33334"
   height="341.33334"
   viewBox="0 0 341.33334 341.33334"
   sodipodi:docname="TDE OS Lite Logo.svg"
   inkscape:version="1.1.2 (0a00cf5339, 2022-02-04)"
   xmlns:inkscape="http://www.inkscape.org/namespaces/inkscape"
   xmlns:sodipodi="http://sodipodi.sourceforge.net/DTD/sodipodi-0.dtd"
   xmlns="http://www.w3.org/2000/svg"
   xmlns:svg="http://www.w3.org/2000/svg">
  <defs
     id="defs6">
    <rect
       x="70.353974"
       y="65.568249"
       width="254.92616"
       height="177.67262"
       id="rect1370" />
  </defs>
  <sodipodi:namedview
     id="namedview4"
     pagecolor="#ffffff"
     bordercolor="#666666"
     borderopacity="1.0"
     inkscape:pageshadow="2"
     inkscape:pageopacity="0.0"
     inkscape:pagecheckerboard="0"
     showgrid="false"
     inkscape:snap-global="false"
     inkscape:zoom="0.75292966"
     inkscape:cx="469.49937"
     inkscape:cy="245.70688"
     inkscape:window-width="1366"
     inkscape:window-height="695"
     inkscape:window-x="0"
     inkscape:window-y="37"
     inkscape:window-maximized="1"
     inkscape:current-layer="g8" />
  <g
     inkscape:groupmode="layer"
     inkscape:label="Image"
     id="g8">
    <g
       aria-label="T"
       transform="matrix(4.8973435,3.1425799,-3.1425799,4.8973435,73.754789,-547.34703)"
       id="text1368"
       style="font-size:40px;line-height:1.25;white-space:pre;shape-inside:url(#rect1370);fill:#007bff">
      <path
         d="m 70.236328,71.798828 h 24.667969 v 3.320313 l -5.679846,1.405432 -4.671717,24.434407 H 80.587891 L 76.207445,76.219536 70.236328,75.119141 Z"
         id="path844"
         sodipodi:nodetypes="ccccccccc" />
    </g>
    <path
       id="path4496"
       style="fill:#007bff;stroke-width:0.632261"
       d="m 57.001632,91.540539 c -13.125279,10.464431 -6.656026,23.178731 0.383667,38.417521 l 11.717797,25.36648 c 1.057504,2.28917 2.467881,4.22828 4.135724,5.84698 a 94.832369,94.832369 0 0 0 -0.05031,0.44599 l -16.803966,19.09398 c -11.090111,12.60105 -23.288655,21.89715 -14.275501,36.05839 9.013156,14.16122 19.931612,8.02272 36.023914,3.24615 l 8.238864,-2.44502 a 94.832369,94.832369 0 0 0 7.055529,10.27386 94.832369,94.832369 0 0 0 3.485374,3.78329 l -7.099178,10.85121 c -9.189304,14.04759 -18.952605,24.95213 -7.84581,37.53848 11.106797,12.58638 23.722174,7.18526 38.304034,-1.1302 l 24.79619,-14.14066 c 1.53936,-0.87784 2.89667,-1.9145 4.09906,-3.0675 a 94.832369,94.832369 0 0 0 5.17697,0.74475 c 0.72279,1.116 1.55749,2.18862 2.53423,3.19446 l 15.89925,16.37243 c 11.69407,12.04268 26.13007,25.01412 40.3349,16.06982 14.20482,-8.94431 6.56705,-22.32169 2.16664,-38.52089 l -2.12537,-7.82407 a 94.832369,94.832369 0 0 0 13.54092,-8.83905 94.832369,94.832369 0 0 0 2.15934,-1.81003 l 5.61175,4.05742 c 13.60331,9.83501 27.96111,16.59285 40.08856,4.9867 12.12743,-11.60615 4.33024,-26.70275 -4.51119,-40.97184 l -10.57274,-17.06247 a 94.832369,94.832369 0 0 0 2.50227,-14.80647 80.754335,80.754335 0 0 1 -27.10315,40.9111 80.754335,80.754335 0 0 1 -113.4838,-12.80058 80.754335,80.754335 0 0 1 12.79982,-113.484757 80.754335,80.754335 0 0 1 42.71986,-17.23489 94.832369,94.832369 0 0 0 -4.66552,-0.628186 L 148.17413,57.577676 c -13.85653,-9.4749 -21.9177,-19.758105 -35.04299,-9.293667 -13.12528,10.464443 -5.46508,16.859007 0.42,32.579802 l 2.97854,7.957212 a 94.832369,94.832369 0 0 0 -8.07099,5.755692 94.832369,94.832369 0 0 0 -9.716375,8.953195 l -2.784476,-2.19895 C 82.785353,90.925997 70.126916,81.076095 57.001632,91.540539 Z" />
  </g>
</svg>
