%YAML 1.1
%TAG !u! tag:unity3d.com,2011:
--- !u!114 &11400000
MonoBehaviour:
  m_ObjectHideFlags: 0
  m_CorrespondingSourceObject: {fileID: 0}
  m_PrefabInstance: {fileID: 0}
  m_PrefabAsset: {fileID: 0}
  m_GameObject: {fileID: 0}
  m_Enabled: 1
  m_EditorHideFlags: 0
  m_Script: {fileID: 11500000, guid: 9b3eacad1d4742e4a929384321f2cec4, type: 3}
  m_Name: ku
  m_EditorClassIdentifier: 
  clip: {fileID: 8300000, guid: ab68680a4d3a5da4cb5175e5184593a7, type: 3}
  chainTime: 0.18
  preChainTime: 0.02
