%YAML 1.1
%TAG !u! tag:unity3d.com,2011:
--- !u!114 &11400000
MonoBehaviour:
  m_ObjectHideFlags: 0
  m_CorrespondingSourceObject: {fileID: 0}
  m_PrefabInstance: {fileID: 0}
  m_PrefabAsset: {fileID: 0}
  m_GameObject: {fileID: 0}
  m_Enabled: 1
  m_EditorHideFlags: 0
  m_Script: {fileID: 11500000, guid: 9b3eacad1d4742e4a929384321f2cec4, type: 3}
  m_Name: l
  m_EditorClassIdentifier: 
  clip: {fileID: 8300000, guid: d06c079226006aa44bffdbd7f277bc1d, type: 3}
  chainTime: 0.22
  preChainTime: 0.05
