%!PS-Adobe-3.0 EPSF-3.0
%%Creator: cairo 1.16.0 (https://cairographics.org)
%%CreationDate: Thu Apr  8 07:10:39 2021
%%Pages: 1
%%DocumentData: Clean7Bit
%%LanguageLevel: 2
%%BoundingBox: 0 23 384 361
%%EndComments
%%BeginProlog
50 dict begin
/q { gsave } bind def
/Q { grestore } bind def
/cm { 6 array astore concat } bind def
/w { setlinewidth } bind def
/J { setlinecap } bind def
/j { setlinejoin } bind def
/M { setmiterlimit } bind def
/d { setdash } bind def
/m { moveto } bind def
/l { lineto } bind def
/c { curveto } bind def
/h { closepath } bind def
/re { exch dup neg 3 1 roll 5 3 roll moveto 0 rlineto
      0 exch rlineto 0 rlineto closepath } bind def
/S { stroke } bind def
/f { fill } bind def
/f* { eofill } bind def
/n { newpath } bind def
/W { clip } bind def
/W* { eoclip } bind def
/BT { } bind def
/ET { } bind def
/BDC { mark 3 1 roll /BDC pdfmark } bind def
/EMC { mark /EMC pdfmark } bind def
/cairo_store_point { /cairo_point_y exch def /cairo_point_x exch def } def
/Tj { show currentpoint cairo_store_point } bind def
/TJ {
  {
    dup
    type /stringtype eq
    { show } { -0.001 mul 0 cairo_font_matrix dtransform rmoveto } ifelse
  } forall
  currentpoint cairo_store_point
} bind def
/cairo_selectfont { cairo_font_matrix aload pop pop pop 0 0 6 array astore
    cairo_font exch selectfont cairo_point_x cairo_point_y moveto } bind def
/Tf { pop /cairo_font exch def /cairo_font_matrix where
      { pop cairo_selectfont } if } bind def
/Td { matrix translate cairo_font_matrix matrix concatmatrix dup
      /cairo_font_matrix exch def dup 4 get exch 5 get cairo_store_point
      /cairo_font where { pop cairo_selectfont } if } bind def
/Tm { 2 copy 8 2 roll 6 array astore /cairo_font_matrix exch def
      cairo_store_point /cairo_font where { pop cairo_selectfont } if } bind def
/g { setgray } bind def
/rg { setrgbcolor } bind def
/d1 { setcachedevice } bind def
/cairo_data_source {
  CairoDataIndex CairoData length lt
    { CairoData CairoDataIndex get /CairoDataIndex CairoDataIndex 1 add def }
    { () } ifelse
} def
/cairo_flush_ascii85_file { cairo_ascii85_file status { cairo_ascii85_file flushfile } if } def
/cairo_image { image cairo_flush_ascii85_file } def
/cairo_imagemask { imagemask cairo_flush_ascii85_file } def
%%EndProlog
%%BeginSetup
%%EndSetup
%%Page: 1 1
%%BeginPageSetup
%%PageBoundingBox: 0 23 384 361
%%EndPageSetup
q 0 23 384 338 rectclip
1 0 0 -1 0 384 cm q
1 0.454902 0.34902 rg
350.25 23.25 m 33.75 23.25 l 15.074 23.25 0 38.324 0 57 c 0 327 l 0 345.676
 15.074 360.75 33.75 360.75 c 350.25 360.75 l 368.926 360.75 384 345.676
 384 327 c 384 57 l 384 38.324 368.926 23.25 350.25 23.25 c h
350.25 23.25 m f
0.94902 0.294118 0.235294 rg
384 57 m 384 327 l 384 345.676 368.926 360.75 350.25 360.75 c 192 360.75
 l 192 23.25 l 350.25 23.25 l 368.926 23.25 384 38.324 384 57 c h
384 57 m f
0.301961 0.368627 0.501961 rg
180.75 45.75 m 33.75 45.75 l 27.535 45.75 22.5 50.785 22.5 57 c 22.5 327
 l 22.5 333.215 27.535 338.25 33.75 338.25 c 180.75 338.25 l h
180.75 45.75 m f
0.239216 0.270588 0.4 rg
361.5 57 m 361.5 50.785 356.465 45.75 350.25 45.75 c 203.25 45.75 l 203.25
 158.25 l 361.5 158.25 l h
361.5 57 m f
203.25 180.75 m 203.25 338.25 l 350.25 338.25 l 356.465 338.25 361.5 333.215
 361.5 327 c 361.5 180.75 l h
203.25 180.75 m f
0.4 0.74902 0.223529 rg
304.5 135.75 m 285.891 135.75 270.75 120.609 270.75 102 c 270.75 83.391
 285.891 68.25 304.5 68.25 c 323.109 68.25 338.25 83.391 338.25 102 c 338.25
 120.609 323.109 135.75 304.5 135.75 c h
304.5 135.75 m f
0.952941 0.960784 0.976471 rg
102 315.75 m 86.797 315.75 73.168 305.641 68.949 291.801 c 55.109 287.594
 45 274.703 45 259.5 c 45 250.863 48.254 242.977 53.613 237 c 48.254 231.023
 45 223.137 45 214.5 c 45 205.863 48.254 197.977 53.613 192 c 48.254 186.023
 45 178.137 45 169.5 c 45 160.863 48.254 152.977 53.613 147 c 48.254 141.023
 45 133.137 45 124.5 c 45 109.297 55.109 96.406 68.949 92.199 c 73.168 78.359
 86.797 68.25 102 68.25 c 117.203 68.25 130.082 78.359 134.301 92.199 c 
148.141 96.406 158.25 109.297 158.25 124.5 c 158.25 133.137 154.996 141.023
 149.637 147 c 154.996 152.977 158.25 160.863 158.25 169.5 c 158.25 178.137
 154.996 186.023 149.637 192 c 154.996 197.977 158.25 205.863 158.25 214.5
 c 158.25 223.137 154.996 231.023 149.637 237 c 154.996 242.977 158.25 250.863
 158.25 259.5 c 158.25 274.703 148.141 287.594 134.301 291.801 c 130.082
 305.641 117.203 315.75 102 315.75 c h
102 315.75 m f
0.882353 0.901961 0.941176 rg
282 315.75 m 257.191 315.75 237 295.566 237 270.75 c 237 251.16 252.777
 203.25 282 203.25 c 311.223 203.25 327 251.16 327 270.75 c 327 295.566 
306.809 315.75 282 315.75 c h
282 315.75 m f
0.596078 0.85098 0.341176 rg
259.5 135.75 m 240.891 135.75 225.75 120.609 225.75 102 c 225.75 83.391
 240.891 68.25 259.5 68.25 c 278.109 68.25 293.25 83.391 293.25 102 c 293.25
 120.609 278.109 135.75 259.5 135.75 c h
259.5 135.75 m f
1 0.74902 0.25098 rg
293.25 270.75 m 293.25 276.965 288.215 282 282 282 c 275.785 282 270.75
 276.965 270.75 270.75 c 270.75 264.535 275.785 259.5 282 259.5 c 288.215
 259.5 293.25 264.535 293.25 270.75 c h
293.25 270.75 m f
Q Q
showpage
%%Trailer
end
%%EOF
