%!PS-Adobe-3.0 EPSF-3.0
%%Creator: cairo 1.16.0 (https://cairographics.org)
%%CreationDate: Thu Apr  8 07:10:35 2021
%%Pages: 1
%%DocumentData: Clean7Bit
%%LanguageLevel: 2
%%BoundingBox: 0 0 384 384
%%EndComments
%%BeginProlog
50 dict begin
/q { gsave } bind def
/Q { grestore } bind def
/cm { 6 array astore concat } bind def
/w { setlinewidth } bind def
/J { setlinecap } bind def
/j { setlinejoin } bind def
/M { setmiterlimit } bind def
/d { setdash } bind def
/m { moveto } bind def
/l { lineto } bind def
/c { curveto } bind def
/h { closepath } bind def
/re { exch dup neg 3 1 roll 5 3 roll moveto 0 rlineto
      0 exch rlineto 0 rlineto closepath } bind def
/S { stroke } bind def
/f { fill } bind def
/f* { eofill } bind def
/n { newpath } bind def
/W { clip } bind def
/W* { eoclip } bind def
/BT { } bind def
/ET { } bind def
/BDC { mark 3 1 roll /BDC pdfmark } bind def
/EMC { mark /EMC pdfmark } bind def
/cairo_store_point { /cairo_point_y exch def /cairo_point_x exch def } def
/Tj { show currentpoint cairo_store_point } bind def
/TJ {
  {
    dup
    type /stringtype eq
    { show } { -0.001 mul 0 cairo_font_matrix dtransform rmoveto } ifelse
  } forall
  currentpoint cairo_store_point
} bind def
/cairo_selectfont { cairo_font_matrix aload pop pop pop 0 0 6 array astore
    cairo_font exch selectfont cairo_point_x cairo_point_y moveto } bind def
/Tf { pop /cairo_font exch def /cairo_font_matrix where
      { pop cairo_selectfont } if } bind def
/Td { matrix translate cairo_font_matrix matrix concatmatrix dup
      /cairo_font_matrix exch def dup 4 get exch 5 get cairo_store_point
      /cairo_font where { pop cairo_selectfont } if } bind def
/Tm { 2 copy 8 2 roll 6 array astore /cairo_font_matrix exch def
      cairo_store_point /cairo_font where { pop cairo_selectfont } if } bind def
/g { setgray } bind def
/rg { setrgbcolor } bind def
/d1 { setcachedevice } bind def
/cairo_data_source {
  CairoDataIndex CairoData length lt
    { CairoData CairoDataIndex get /CairoDataIndex CairoDataIndex 1 add def }
    { () } ifelse
} def
/cairo_flush_ascii85_file { cairo_ascii85_file status { cairo_ascii85_file flushfile } if } def
/cairo_image { image cairo_flush_ascii85_file } def
/cairo_imagemask { imagemask cairo_flush_ascii85_file } def
%%EndProlog
%%BeginSetup
%%EndSetup
%%Page: 1 1
%%BeginPageSetup
%%PageBoundingBox: 0 0 384 384
%%EndPageSetup
q 0 0 384 384 rectclip
1 0 0 -1 0 384 cm q
1 0.454902 0.34902 rg
384 192 m 384 298.039 298.039 384 192 384 c 85.961 384 0 298.039 0 192 
c 0 85.961 85.961 0 192 0 c 298.039 0 384 85.961 384 192 c h
384 192 m f
0.94902 0.294118 0.235294 rg
384 192 m 384 86.543 297.445 0 192 0 c 192 384 l 297.445 384 384 297.457
 384 192 c h
384 192 m f
0.901961 0.580392 0.360784 rg
361.5 192 m 361.5 285.613 285.613 361.5 192 361.5 c 98.387 361.5 22.5 285.613
 22.5 192 c 22.5 98.387 98.387 22.5 192 22.5 c 285.613 22.5 361.5 98.387
 361.5 192 c h
361.5 192 m f
0.8 0.427451 0.239216 rg
361.5 192 m 361.5 98.945 285.055 22.5 192 22.5 c 192 361.5 l 285.055 361.5
 361.5 285.055 361.5 192 c h
361.5 192 m f
0.901961 0.580392 0.360784 rg
216.082 325.32 m 214.477 319.32 218.059 313.156 224.059 311.555 c 244.953
 305.973 264.113 294.887 279.496 279.508 c 316.52 242.484 326.254 185.871
 303.688 138.641 c 301.008 133.039 303.379 126.324 308.984 123.645 c 314.543
 120.965 321.309 123.336 323.992 128.949 c 350.664 184.762 339.172 251.668
 295.402 295.414 c 277.23 313.586 254.578 326.684 229.859 333.285 c 223.988
 334.887 217.707 331.414 216.082 325.32 c h
216.082 325.32 m f
199.824 282.363 m 198.527 276.285 202.414 270.309 208.48 269.016 c 244.559
 261.336 270.75 228.945 270.75 192 c 270.75 185.781 275.781 180.75 282 180.75
 c 288.219 180.75 293.25 185.781 293.25 192 c 293.25 239.504 259.566 281.152
 213.18 291.031 c 207.031 292.312 201.102 288.395 199.824 282.363 c h
199.824 282.363 m f
1 0.752941 0.501961 rg
273.629 70.621 m 248.812 53.898 220.34 46.25 192 46.285 c 154.27 46.332
 116.793 60.383 88.598 88.586 c 60.977 116.203 45.75 152.934 45.75 192 c
 45.75 231.066 60.977 267.797 88.598 295.414 c 92.992 299.809 100.109 299.809
 104.504 295.414 c 108.898 291.02 108.898 283.902 104.504 279.508 c 81.125
 256.129 68.25 225.059 68.25 192 c 68.25 158.941 81.125 127.871 104.504 
104.492 c 128.367 80.617 160.082 68.719 192 68.68 c 215.98 68.648 240.07
 75.121 261.059 89.277 c 266.27 92.781 267.023 101.078 261.938 106.141 c
 258.16 109.91 252.141 110.293 247.172 107.086 c 230.348 96.133 211.133 
91.133 192 91.168 c 165.832 91.215 139.832 100.961 120.414 120.402 c 116.02
 124.797 116.02 131.914 120.414 136.309 c 124.809 140.703 131.926 140.703
 136.32 136.309 c 151.441 121.195 171.66 113.617 192 113.57 c 206.887 113.539
 221.836 117.422 234.914 125.938 c 248.82 135.012 266.488 133.43 277.848
 122.059 c 292.723 107.188 290.871 82.223 273.629 70.621 c h
273.629 70.621 m f
192 135.785 m 177.594 135.785 163.195 141.266 152.25 152.219 c 147.988 
156.449 144.453 161.328 141.75 166.688 c 138.957 172.234 141.176 179.004
 146.715 181.805 c 152.23 184.586 159.02 182.375 161.832 176.84 c 163.457
 173.609 165.566 170.688 168.137 168.137 c 174.707 161.559 183.352 158.266
 192 158.266 c 200.645 158.266 209.293 161.555 215.859 168.137 c 227.574
 179.848 229 198.711 219.18 212.004 c 215.488 217.004 216.543 224.047 221.551
 227.738 c 226.465 231.383 233.523 230.43 237.285 225.367 c 253.656 203.195
 251.281 171.754 231.77 152.23 c 220.809 141.266 206.402 135.785 192 135.785
 c h
192 135.785 m f
0.901961 0.580392 0.360784 rg
234.914 125.938 m 248.82 135.016 266.488 133.434 277.848 122.062 c 292.723
 107.188 290.875 82.223 273.629 70.621 c 248.812 53.898 220.34 46.25 192
 46.285 c 192 68.68 l 215.98 68.648 240.07 75.121 261.059 89.277 c 266.27
 92.781 267.023 101.078 261.938 106.141 c 258.16 109.91 252.141 110.293 
247.172 107.086 c 230.348 96.133 211.133 91.133 192 91.168 c 192 113.574
 l 206.887 113.539 221.836 117.422 234.914 125.938 c h
234.914 125.938 m f
219.18 212.008 m 215.488 217.004 216.543 224.047 221.555 227.738 c 226.465
 231.383 233.523 230.43 237.285 225.367 c 253.656 203.195 251.281 171.754
 231.77 152.23 c 220.809 141.266 206.402 135.789 192 135.785 c 192 158.266
 l 200.645 158.266 209.293 161.559 215.863 168.137 c 227.574 179.848 229.004
 198.711 219.18 212.008 c h
219.18 212.008 m f
0.952941 0.960784 0.976471 rg
192 172.309 m 175.758 164.484 158.25 160.031 143.352 160.031 c 99.934 160.031
 64.602 195.363 64.602 238.781 c 64.602 282.199 99.934 317.531 143.352 317.531
 c 158.25 317.531 175.758 313.078 192 305.254 c 220.227 291.648 244.602 
267.777 244.602 238.781 c 244.602 209.785 220.227 185.91 192 172.309 c h
192 172.309 m f
0.882353 0.901961 0.941176 rg
244.602 238.781 m 244.602 209.785 220.227 185.91 192 172.309 c 192 305.25
 l 220.227 291.648 244.602 267.777 244.602 238.781 c h
244.602 238.781 m f
1 0.882353 0.298039 rg
143.352 272.531 m 124.742 272.531 109.602 257.391 109.602 238.781 c 109.602
 220.168 124.742 205.031 143.352 205.031 c 161.965 205.031 177.102 220.168
 177.102 238.781 c 177.102 257.391 161.965 272.531 143.352 272.531 c h
143.352 272.531 m f
Q Q
showpage
%%Trailer
end
%%EOF
