%!PS-Adobe-3.0 EPSF-3.0
%%Creator: cairo 1.16.0 (https://cairographics.org)
%%CreationDate: Thu Apr  8 07:10:25 2021
%%Pages: 1
%%DocumentData: Clean7Bit
%%LanguageLevel: 2
%%BoundingBox: 0 45 384 339
%%EndComments
%%BeginProlog
50 dict begin
/q { gsave } bind def
/Q { grestore } bind def
/cm { 6 array astore concat } bind def
/w { setlinewidth } bind def
/J { setlinecap } bind def
/j { setlinejoin } bind def
/M { setmiterlimit } bind def
/d { setdash } bind def
/m { moveto } bind def
/l { lineto } bind def
/c { curveto } bind def
/h { closepath } bind def
/re { exch dup neg 3 1 roll 5 3 roll moveto 0 rlineto
      0 exch rlineto 0 rlineto closepath } bind def
/S { stroke } bind def
/f { fill } bind def
/f* { eofill } bind def
/n { newpath } bind def
/W { clip } bind def
/W* { eoclip } bind def
/BT { } bind def
/ET { } bind def
/BDC { mark 3 1 roll /BDC pdfmark } bind def
/EMC { mark /EMC pdfmark } bind def
/cairo_store_point { /cairo_point_y exch def /cairo_point_x exch def } def
/Tj { show currentpoint cairo_store_point } bind def
/TJ {
  {
    dup
    type /stringtype eq
    { show } { -0.001 mul 0 cairo_font_matrix dtransform rmoveto } ifelse
  } forall
  currentpoint cairo_store_point
} bind def
/cairo_selectfont { cairo_font_matrix aload pop pop pop 0 0 6 array astore
    cairo_font exch selectfont cairo_point_x cairo_point_y moveto } bind def
/Tf { pop /cairo_font exch def /cairo_font_matrix where
      { pop cairo_selectfont } if } bind def
/Td { matrix translate cairo_font_matrix matrix concatmatrix dup
      /cairo_font_matrix exch def dup 4 get exch 5 get cairo_store_point
      /cairo_font where { pop cairo_selectfont } if } bind def
/Tm { 2 copy 8 2 roll 6 array astore /cairo_font_matrix exch def
      cairo_store_point /cairo_font where { pop cairo_selectfont } if } bind def
/g { setgray } bind def
/rg { setrgbcolor } bind def
/d1 { setcachedevice } bind def
/cairo_data_source {
  CairoDataIndex CairoData length lt
    { CairoData CairoDataIndex get /CairoDataIndex CairoDataIndex 1 add def }
    { () } ifelse
} def
/cairo_flush_ascii85_file { cairo_ascii85_file status { cairo_ascii85_file flushfile } if } def
/cairo_image { image cairo_flush_ascii85_file } def
/cairo_imagemask { imagemask cairo_flush_ascii85_file } def
%%EndProlog
%%BeginSetup
%%EndSetup
%%Page: 1 1
%%BeginPageSetup
%%PageBoundingBox: 0 45 384 339
%%EndPageSetup
q 0 45 384 294 rectclip
1 0 0 -1 0 384 cm q
0.952941 0.960784 0.976471 rg
192 45.75 m 86.555 45.75 0 121.445 0 214.5 c 0 276.598 37.629 315.504 110.637
 330.801 c 192 330.941 l 272.023 331.082 l 345.836 316.004 384 277.027 384
 214.5 c 384 121.445 297.445 45.75 192 45.75 c h
192 45.75 m f
0.882353 0.901961 0.941176 rg
384 214.5 m 384 121.445 297.445 45.75 192 45.75 c 192 330.941 l 272.023
 331.082 l 345.836 316.004 384 277.027 384 214.5 c h
384 214.5 m f
0.596078 0.85098 0.341176 rg
336.402 233.816 m 335.129 228.125 329.637 224.398 323.945 225.102 c 323.527
 225.156 316.695 226.07 307.07 228.016 c 306.281 208.031 302.961 190.113
 302.785 189.18 c 301.688 183.301 296.105 179.434 290.262 180.102 c 289.801
 180.156 281.914 181.211 271.125 183.477 c 270.375 163.305 266.992 145.121
 266.816 144.18 c 265.719 138.312 260.051 134.301 254.293 135.102 c 254.293
 135.102 247.262 136.035 237.309 138.035 c 223.508 115.723 200.812 94.102
 199.734 93.09 c 197.559 91.035 194.781 90.008 192 90.008 c 189.223 90.008
 186.441 91.035 184.266 93.09 c 183.191 94.102 160.359 115.855 146.582 138.223
 c 136.125 136.09 128.633 135.102 128.633 135.102 c 122.699 134.324 117.207
 138.309 116.109 144.18 c 115.934 145.121 112.547 163.328 111.801 183.496
 c 100.945 181.223 92.992 180.16 92.531 180.102 c 86.754 179.434 81.105 
183.301 80.008 189.18 c 79.832 190.113 76.512 208.02 75.723 227.98 c 66.164
 226.059 59.375 225.16 58.98 225.102 c 52.871 224.422 47.355 229.102 46.324
 235.004 c 38.586 278.605 67.383 321.191 110.637 330.801 c 128.984 334.648
 151.848 337.367 180.75 337.992 c 192 315.754 l 203.25 338.008 l 231.586
 337.426 253.637 334.832 272.023 331.082 c 315.434 321.652 344.379 278.988
 336.402 233.816 c h
336.402 233.816 m f
0.4 0.74902 0.223529 rg
272.023 331.082 m 315.434 321.652 344.379 278.988 336.406 233.816 c 335.129
 228.125 329.637 224.398 323.945 225.102 c 323.527 225.156 316.695 226.07
 307.07 228.016 c 306.281 208.031 302.961 190.113 302.785 189.18 c 301.688
 183.301 296.109 179.434 290.262 180.102 c 289.801 180.156 281.914 181.211
 271.125 183.477 c 270.379 163.305 266.992 145.121 266.816 144.18 c 265.719
 138.312 260.051 134.301 254.293 135.102 c 254.293 135.102 247.262 136.035
 237.309 138.035 c 223.512 115.723 200.812 94.102 199.734 93.09 c 197.559
 91.035 194.781 90.008 192 90.008 c 192 315.75 l 203.25 338.004 l 231.586
 337.422 253.637 334.832 272.023 331.082 c h
272.023 331.082 m f
244.953 229.047 m 240.559 224.652 233.441 224.652 229.047 229.047 c 203.25
 254.844 l 203.25 219.16 l 222.453 199.957 l 226.848 195.562 226.848 188.441
 222.453 184.047 c 218.059 179.652 210.941 179.652 206.547 184.047 c 192
 198.594 l 177.453 184.047 l 173.059 179.652 165.941 179.652 161.547 184.047
 c 157.152 188.441 157.152 195.559 161.547 199.953 c 180.75 219.16 l 180.75
 254.844 l 154.953 229.047 l 150.559 224.652 143.441 224.652 139.047 229.047
 c 134.652 233.441 134.652 240.559 139.047 244.953 c 180.75 286.66 l 180.75
 337.988 l 184.516 338.07 188.02 338.242 192 338.246 c 192.027 338.246 192.051
 338.25 192.082 338.25 c 196.059 338.25 199.512 338.082 203.25 338.004 c
 203.25 286.66 l 244.953 244.957 l 249.348 240.559 249.348 233.441 244.953
 229.047 c h
244.953 229.047 m f
0.160784 0.65098 0.0627451 rg
203.25 338.004 m 203.25 286.66 l 244.953 244.957 l 249.348 240.562 249.348
 233.441 244.953 229.047 c 240.559 224.652 233.441 224.652 229.047 229.047
 c 203.25 254.844 l 203.25 219.16 l 222.453 199.957 l 226.848 195.562 226.848
 188.441 222.453 184.047 c 218.059 179.652 210.941 179.652 206.547 184.047
 c 192 198.594 l 192 338.246 l 192.027 338.246 192.051 338.25 192.082 338.25
 c 196.059 338.25 199.512 338.082 203.25 338.004 c h
203.25 338.004 m f
Q Q
showpage
%%Trailer
end
%%EOF
