%!PS-Adobe-3.0 EPSF-3.0
%%Creator: cairo 1.16.0 (https://cairographics.org)
%%CreationDate: Thu Apr  8 07:10:30 2021
%%Pages: 1
%%DocumentData: Clean7Bit
%%LanguageLevel: 2
%%BoundingBox: 0 34 384 350
%%EndComments
%%BeginProlog
50 dict begin
/q { gsave } bind def
/Q { grestore } bind def
/cm { 6 array astore concat } bind def
/w { setlinewidth } bind def
/J { setlinecap } bind def
/j { setlinejoin } bind def
/M { setmiterlimit } bind def
/d { setdash } bind def
/m { moveto } bind def
/l { lineto } bind def
/c { curveto } bind def
/h { closepath } bind def
/re { exch dup neg 3 1 roll 5 3 roll moveto 0 rlineto
      0 exch rlineto 0 rlineto closepath } bind def
/S { stroke } bind def
/f { fill } bind def
/f* { eofill } bind def
/n { newpath } bind def
/W { clip } bind def
/W* { eoclip } bind def
/BT { } bind def
/ET { } bind def
/BDC { mark 3 1 roll /BDC pdfmark } bind def
/EMC { mark /EMC pdfmark } bind def
/cairo_store_point { /cairo_point_y exch def /cairo_point_x exch def } def
/Tj { show currentpoint cairo_store_point } bind def
/TJ {
  {
    dup
    type /stringtype eq
    { show } { -0.001 mul 0 cairo_font_matrix dtransform rmoveto } ifelse
  } forall
  currentpoint cairo_store_point
} bind def
/cairo_selectfont { cairo_font_matrix aload pop pop pop 0 0 6 array astore
    cairo_font exch selectfont cairo_point_x cairo_point_y moveto } bind def
/Tf { pop /cairo_font exch def /cairo_font_matrix where
      { pop cairo_selectfont } if } bind def
/Td { matrix translate cairo_font_matrix matrix concatmatrix dup
      /cairo_font_matrix exch def dup 4 get exch 5 get cairo_store_point
      /cairo_font where { pop cairo_selectfont } if } bind def
/Tm { 2 copy 8 2 roll 6 array astore /cairo_font_matrix exch def
      cairo_store_point /cairo_font where { pop cairo_selectfont } if } bind def
/g { setgray } bind def
/rg { setrgbcolor } bind def
/d1 { setcachedevice } bind def
/cairo_data_source {
  CairoDataIndex CairoData length lt
    { CairoData CairoDataIndex get /CairoDataIndex CairoDataIndex 1 add def }
    { () } ifelse
} def
/cairo_flush_ascii85_file { cairo_ascii85_file status { cairo_ascii85_file flushfile } if } def
/cairo_image { image cairo_flush_ascii85_file } def
/cairo_imagemask { imagemask cairo_flush_ascii85_file } def
%%EndProlog
%%BeginSetup
%%EndSetup
%%Page: 1 1
%%BeginPageSetup
%%PageBoundingBox: 0 34 384 350
%%EndPageSetup
q 0 34 384 316 rectclip
1 0 0 -1 0 384 cm q
0.596078 0.85098 0.341176 rg
292.305 147.926 m 288.367 126.738 272.422 109.887 251.895 104.211 c 254.043
 94.453 253.539 84.867 249.855 75.965 c 242.605 58.41 224.324 44.656 195.559
 35.066 c 194.387 34.668 193.188 34.52 192 34.52 c 188.074 34.516 184.309
 36.547 182.266 40.109 c 179.586 44.734 180.531 50.609 184.531 54.148 c 
186.75 56.113 187.363 57.566 187.473 57.566 c 187.234 58.004 185.234 59.84
 179.871 60.664 c 157.043 64.176 140.031 81.039 136.613 101.984 c 135.75
 101.984 l 110.898 101.984 90.75 122.129 90.75 146.984 c 135.75 158.234 
l 90.75 169.484 l 90.75 169.625 l 65.789 170.379 45.75 190.73 45.75 215.875
 c 45.75 248.234 l 45.75 254.445 50.789 259.484 57 259.484 c 327 259.484
 l 333.215 259.484 338.25 254.445 338.25 248.234 c 338.25 203.234 l 338.25
 175.734 318.41 152.781 292.305 147.926 c h
292.305 147.926 m f
0.4 0.74902 0.223529 rg
338.25 248.23 m 338.25 203.23 l 338.25 175.734 318.41 152.781 292.305 147.926
 c 288.367 126.738 272.422 109.887 251.895 104.211 c 254.043 94.453 253.539
 84.867 249.855 75.965 c 242.605 58.41 224.324 44.656 195.559 35.066 c 194.387
 34.668 193.188 34.52 192 34.52 c 192 259.48 l 327 259.48 l 333.215 259.48
 338.25 254.445 338.25 248.23 c h
338.25 248.23 m f
0.160784 0.65098 0.0627451 rg
248.25 158.23 m 248.25 164.445 243.215 169.48 237 169.48 c 230.785 169.48
 225.75 164.445 225.75 158.23 c 225.75 152.02 230.785 146.98 237 146.98 
c 243.215 146.98 248.25 152.02 248.25 158.23 c h
248.25 158.23 m f
0.4 0.74902 0.223529 rg
180.75 158.23 m 180.75 152.016 175.715 146.98 169.5 146.98 c 90.75 146.98
 l 90.75 169.48 l 169.5 169.48 l 175.715 169.48 180.75 164.445 180.75 158.23
 c h
180.75 158.23 m f
1 0.454902 0.34902 rg
372.746 236.98 m 11.254 236.98 l 4.375 236.98 -0.848 243.086 0.113 249.824
 c 6.066 291.277 41.445 319.664 92.18 325.762 c 101.273 326.848 109.055 
333.168 111.996 341.844 c 113.559 346.406 117.844 349.48 122.652 349.48 
c 259.5 349.48 l 265.719 349.48 270.75 344.086 270.75 337.867 c 270.75 331.938
 275.387 327.027 281.32 326.684 c 337.215 323.488 377.445 294.043 383.887
 249.848 c 384.844 243.148 379.676 236.98 372.746 236.98 c h
372.746 236.98 m f
0.94902 0.294118 0.235294 rg
270.75 337.867 m 270.75 331.938 275.387 327.027 281.32 326.684 c 337.219
 323.488 377.449 294.043 383.887 249.848 c 384.844 243.148 379.676 236.98
 372.746 236.98 c 192 236.98 l 192 349.48 l 259.5 349.48 l 265.719 349.48
 270.75 344.086 270.75 337.867 c h
270.75 337.867 m f
Q Q
showpage
%%Trailer
end
%%EOF
