%!PS-Adobe-3.0 EPSF-3.0
%%Creator: cairo 1.16.0 (https://cairographics.org)
%%CreationDate: Thu Apr  8 07:10:23 2021
%%Pages: 1
%%DocumentData: Clean7Bit
%%LanguageLevel: 2
%%BoundingBox: 0 23 384 361
%%EndComments
%%BeginProlog
50 dict begin
/q { gsave } bind def
/Q { grestore } bind def
/cm { 6 array astore concat } bind def
/w { setlinewidth } bind def
/J { setlinecap } bind def
/j { setlinejoin } bind def
/M { setmiterlimit } bind def
/d { setdash } bind def
/m { moveto } bind def
/l { lineto } bind def
/c { curveto } bind def
/h { closepath } bind def
/re { exch dup neg 3 1 roll 5 3 roll moveto 0 rlineto
      0 exch rlineto 0 rlineto closepath } bind def
/S { stroke } bind def
/f { fill } bind def
/f* { eofill } bind def
/n { newpath } bind def
/W { clip } bind def
/W* { eoclip } bind def
/BT { } bind def
/ET { } bind def
/BDC { mark 3 1 roll /BDC pdfmark } bind def
/EMC { mark /EMC pdfmark } bind def
/cairo_store_point { /cairo_point_y exch def /cairo_point_x exch def } def
/Tj { show currentpoint cairo_store_point } bind def
/TJ {
  {
    dup
    type /stringtype eq
    { show } { -0.001 mul 0 cairo_font_matrix dtransform rmoveto } ifelse
  } forall
  currentpoint cairo_store_point
} bind def
/cairo_selectfont { cairo_font_matrix aload pop pop pop 0 0 6 array astore
    cairo_font exch selectfont cairo_point_x cairo_point_y moveto } bind def
/Tf { pop /cairo_font exch def /cairo_font_matrix where
      { pop cairo_selectfont } if } bind def
/Td { matrix translate cairo_font_matrix matrix concatmatrix dup
      /cairo_font_matrix exch def dup 4 get exch 5 get cairo_store_point
      /cairo_font where { pop cairo_selectfont } if } bind def
/Tm { 2 copy 8 2 roll 6 array astore /cairo_font_matrix exch def
      cairo_store_point /cairo_font where { pop cairo_selectfont } if } bind def
/g { setgray } bind def
/rg { setrgbcolor } bind def
/d1 { setcachedevice } bind def
/cairo_data_source {
  CairoDataIndex CairoData length lt
    { CairoData CairoDataIndex get /CairoDataIndex CairoDataIndex 1 add def }
    { () } ifelse
} def
/cairo_flush_ascii85_file { cairo_ascii85_file status { cairo_ascii85_file flushfile } if } def
/cairo_image { image cairo_flush_ascii85_file } def
/cairo_imagemask { imagemask cairo_flush_ascii85_file } def
%%EndProlog
%%BeginSetup
%%EndSetup
%%Page: 1 1
%%BeginPageSetup
%%PageBoundingBox: 0 23 384 361
%%EndPageSetup
q 0 23 384 338 rectclip
1 0 0 -1 0 384 cm q
0.301961 0.368627 0.501961 rg
265.801 60.375 m 255.227 55.875 248.25 45.523 248.25 34.5 c 248.25 28.426
 243.301 23.25 237 23.25 c 147 23.25 l 140.699 23.25 135.75 28.426 135.75
 34.5 c 135.75 45.523 128.773 55.875 118.199 60.375 c 63.074 82.875 22.5
 128.773 22.5 169.5 c 22.5 192 l 22.5 198.301 27.449 203.25 33.75 203.25
 c 350.25 203.25 l 356.551 203.25 361.5 198.301 361.5 192 c 361.5 169.5 
l 361.5 128.773 320.926 82.875 265.801 60.375 c h
265.801 60.375 m f
0.239216 0.270588 0.4 rg
361.5 169.5 m 361.5 192 l 361.5 198.301 356.551 203.25 350.25 203.25 c 
192 203.25 l 192 23.25 l 237 23.25 l 243.301 23.25 248.25 28.426 248.25 
34.5 c 248.25 45.523 255.227 55.875 265.801 60.375 c 320.926 82.875 361.5
 128.773 361.5 169.5 c h
361.5 169.5 m f
1 0.454902 0.34902 rg
372.75 180.75 m 11.25 180.75 l 5.031 180.75 0 185.781 0 192 c 0 248.449
 32.348 276.332 83.234 300.984 c 101.473 309.828 113.25 328.625 113.25 349.5
 c 113.25 355.719 118.281 360.75 124.5 360.75 c 259.5 360.75 l 265.719 360.75
 270.75 355.102 270.75 348.887 c 270.75 328.625 282.527 309.828 300.766 
300.984 c 351.652 276.332 384 248.449 384 192 c 384 185.781 378.969 180.75
 372.75 180.75 c h
372.75 180.75 m f
0.94902 0.294118 0.235294 rg
270.75 348.887 m 270.75 328.625 282.527 309.828 300.766 300.984 c 351.652
 276.332 384 248.449 384 192 c 384 185.781 378.969 180.75 372.75 180.75 
c 192 180.75 l 192 360.75 l 259.5 360.75 l 265.719 360.75 270.75 355.102
 270.75 348.887 c h
270.75 348.887 m f
Q Q
showpage
%%Trailer
end
%%EOF
