%!PS-Adobe-3.0 EPSF-3.0
%%Creator: cairo 1.16.0 (https://cairographics.org)
%%CreationDate: Thu Apr  8 07:10:39 2021
%%Pages: 1
%%DocumentData: Clean7Bit
%%LanguageLevel: 2
%%BoundingBox: 0 45 384 339
%%EndComments
%%BeginProlog
50 dict begin
/q { gsave } bind def
/Q { grestore } bind def
/cm { 6 array astore concat } bind def
/w { setlinewidth } bind def
/J { setlinecap } bind def
/j { setlinejoin } bind def
/M { setmiterlimit } bind def
/d { setdash } bind def
/m { moveto } bind def
/l { lineto } bind def
/c { curveto } bind def
/h { closepath } bind def
/re { exch dup neg 3 1 roll 5 3 roll moveto 0 rlineto
      0 exch rlineto 0 rlineto closepath } bind def
/S { stroke } bind def
/f { fill } bind def
/f* { eofill } bind def
/n { newpath } bind def
/W { clip } bind def
/W* { eoclip } bind def
/BT { } bind def
/ET { } bind def
/BDC { mark 3 1 roll /BDC pdfmark } bind def
/EMC { mark /EMC pdfmark } bind def
/cairo_store_point { /cairo_point_y exch def /cairo_point_x exch def } def
/Tj { show currentpoint cairo_store_point } bind def
/TJ {
  {
    dup
    type /stringtype eq
    { show } { -0.001 mul 0 cairo_font_matrix dtransform rmoveto } ifelse
  } forall
  currentpoint cairo_store_point
} bind def
/cairo_selectfont { cairo_font_matrix aload pop pop pop 0 0 6 array astore
    cairo_font exch selectfont cairo_point_x cairo_point_y moveto } bind def
/Tf { pop /cairo_font exch def /cairo_font_matrix where
      { pop cairo_selectfont } if } bind def
/Td { matrix translate cairo_font_matrix matrix concatmatrix dup
      /cairo_font_matrix exch def dup 4 get exch 5 get cairo_store_point
      /cairo_font where { pop cairo_selectfont } if } bind def
/Tm { 2 copy 8 2 roll 6 array astore /cairo_font_matrix exch def
      cairo_store_point /cairo_font where { pop cairo_selectfont } if } bind def
/g { setgray } bind def
/rg { setrgbcolor } bind def
/d1 { setcachedevice } bind def
/cairo_data_source {
  CairoDataIndex CairoData length lt
    { CairoData CairoDataIndex get /CairoDataIndex CairoDataIndex 1 add def }
    { () } ifelse
} def
/cairo_flush_ascii85_file { cairo_ascii85_file status { cairo_ascii85_file flushfile } if } def
/cairo_image { image cairo_flush_ascii85_file } def
/cairo_imagemask { imagemask cairo_flush_ascii85_file } def
%%EndProlog
%%BeginSetup
%%EndSetup
%%Page: 1 1
%%BeginPageSetup
%%PageBoundingBox: 0 45 384 339
%%EndPageSetup
q 0 45 384 294 rectclip
1 0 0 -1 0 384 cm q
1 0.454902 0.34902 rg
361.5 113.25 m 373.926 113.25 384 103.176 384 90.75 c 384 78.324 373.926
 68.25 361.5 68.25 c 359.434 68.25 l 354.785 55.172 342.422 45.75 327.75
 45.75 c 319.066 45.75 310.48 49.121 304.5 54.508 c 298.52 49.121 290.684
 45.75 282 45.75 c 273.316 45.75 265.48 49.121 259.5 54.508 c 253.52 49.121
 245.684 45.75 237 45.75 c 228.316 45.75 220.48 49.121 214.5 54.508 c 208.52
 49.121 200.684 45.75 192 45.75 c 183.316 45.75 175.48 49.121 169.5 54.508
 c 163.52 49.121 155.684 45.75 147 45.75 c 138.316 45.75 130.48 49.121 124.5
 54.508 c 118.52 49.121 110.684 45.75 102 45.75 c 93.316 45.75 85.48 49.121
 79.5 54.508 c 73.52 49.121 64.934 45.75 56.25 45.75 c 41.578 45.75 29.215
 55.172 24.566 68.25 c 22.5 68.25 l 10.074 68.25 0 78.324 0 90.75 c 0 103.176
 10.074 113.25 22.5 113.25 c 10.074 113.25 0 123.324 0 135.75 c 0 148.176
 10.074 158.25 22.5 158.25 c 45.711 169.5 l 342.078 169.5 l 361.5 158.25
 l 373.926 158.25 384 148.176 384 135.75 c 384 123.324 373.926 113.25 361.5
 113.25 c h
361.5 113.25 m f
0.94902 0.294118 0.235294 rg
361.5 158.25 m 373.926 158.25 384 148.176 384 135.75 c 384 123.324 373.926
 113.25 361.5 113.25 c 373.926 113.25 384 103.176 384 90.75 c 384 78.324
 373.926 68.25 361.5 68.25 c 359.434 68.25 l 354.785 55.172 342.422 45.75
 327.75 45.75 c 319.066 45.75 310.48 49.121 304.5 54.508 c 298.52 49.121
 290.684 45.75 282 45.75 c 273.316 45.75 265.48 49.121 259.5 54.508 c 253.52
 49.121 245.684 45.75 237 45.75 c 228.316 45.75 220.48 49.121 214.5 54.508
 c 208.52 49.121 200.684 45.75 192 45.75 c 192 169.5 l 342.078 169.5 l h
361.5 158.25 m f
109.953 116.547 m 105.559 112.152 98.441 112.152 94.047 116.547 c 89.652
 120.941 82.531 120.941 78.137 116.547 c 73.742 112.152 73.742 105.031 78.137
 100.637 c 91.277 87.477 112.723 87.477 125.863 100.637 c 130.258 105.031
 130.258 112.152 125.863 116.547 c 121.469 120.941 114.348 120.941 109.953
 116.547 c h
109.953 116.547 m f
0.8 0.160784 0.266667 rg
289.953 116.547 m 285.559 112.152 278.441 112.152 274.047 116.547 c 269.652
 120.941 262.531 120.941 258.137 116.547 c 253.742 112.152 253.742 105.031
 258.137 100.637 c 271.277 87.477 292.723 87.477 305.863 100.637 c 310.258
 105.031 310.258 112.152 305.863 116.547 c 301.469 120.941 294.348 120.941
 289.953 116.547 c h
289.953 116.547 m f
0.301961 0.368627 0.501961 rg
372.75 158.25 m 11.25 158.25 l 5.031 158.25 0 163.281 0 169.5 c 0 282 l
 0 313.016 25.227 338.25 56.25 338.25 c 327.75 338.25 l 358.773 338.25 384
 313.016 384 282 c 384 169.5 l 384 163.281 378.969 158.25 372.75 158.25 
c h
372.75 158.25 m f
0.239216 0.270588 0.4 rg
384 282 m 384 169.5 l 384 163.281 378.969 158.25 372.75 158.25 c 192 158.25
 l 192 338.25 l 327.75 338.25 l 358.773 338.25 384 313.016 384 282 c h
384 282 m f
0.94902 0.294118 0.235294 rg
215.863 100.637 m 209.293 94.059 200.645 90.766 192 90.766 c 183.355 90.766
 174.707 94.059 168.137 100.637 c 163.742 105.031 163.742 112.152 168.137
 116.547 c 172.531 120.941 179.652 120.941 184.047 116.547 c 186.242 114.348
 189.121 113.25 192 113.25 c 194.879 113.25 197.758 114.348 199.953 116.547
 c 204.348 120.941 211.469 120.941 215.863 116.547 c 220.258 112.152 220.258
 105.031 215.863 100.637 c h
215.863 100.637 m f
0.8 0.160784 0.266667 rg
215.863 116.547 m 220.258 112.152 220.258 105.031 215.863 100.637 c 209.293
 94.059 200.645 90.766 192 90.766 c 192 113.25 l 194.879 113.25 197.758 
114.348 199.953 116.547 c 204.348 120.941 211.469 120.941 215.863 116.547
 c h
215.863 116.547 m f
Q Q
showpage
%%Trailer
end
%%EOF
