%!PS-Adobe-3.0 EPSF-3.0
%%Creator: cairo 1.16.0 (https://cairographics.org)
%%CreationDate: Thu Apr  8 07:10:14 2021
%%Pages: 1
%%DocumentData: Clean7Bit
%%LanguageLevel: 2
%%BoundingBox: 0 0 384 384
%%EndComments
%%BeginProlog
50 dict begin
/q { gsave } bind def
/Q { grestore } bind def
/cm { 6 array astore concat } bind def
/w { setlinewidth } bind def
/J { setlinecap } bind def
/j { setlinejoin } bind def
/M { setmiterlimit } bind def
/d { setdash } bind def
/m { moveto } bind def
/l { lineto } bind def
/c { curveto } bind def
/h { closepath } bind def
/re { exch dup neg 3 1 roll 5 3 roll moveto 0 rlineto
      0 exch rlineto 0 rlineto closepath } bind def
/S { stroke } bind def
/f { fill } bind def
/f* { eofill } bind def
/n { newpath } bind def
/W { clip } bind def
/W* { eoclip } bind def
/BT { } bind def
/ET { } bind def
/BDC { mark 3 1 roll /BDC pdfmark } bind def
/EMC { mark /EMC pdfmark } bind def
/cairo_store_point { /cairo_point_y exch def /cairo_point_x exch def } def
/Tj { show currentpoint cairo_store_point } bind def
/TJ {
  {
    dup
    type /stringtype eq
    { show } { -0.001 mul 0 cairo_font_matrix dtransform rmoveto } ifelse
  } forall
  currentpoint cairo_store_point
} bind def
/cairo_selectfont { cairo_font_matrix aload pop pop pop 0 0 6 array astore
    cairo_font exch selectfont cairo_point_x cairo_point_y moveto } bind def
/Tf { pop /cairo_font exch def /cairo_font_matrix where
      { pop cairo_selectfont } if } bind def
/Td { matrix translate cairo_font_matrix matrix concatmatrix dup
      /cairo_font_matrix exch def dup 4 get exch 5 get cairo_store_point
      /cairo_font where { pop cairo_selectfont } if } bind def
/Tm { 2 copy 8 2 roll 6 array astore /cairo_font_matrix exch def
      cairo_store_point /cairo_font where { pop cairo_selectfont } if } bind def
/g { setgray } bind def
/rg { setrgbcolor } bind def
/d1 { setcachedevice } bind def
/cairo_data_source {
  CairoDataIndex CairoData length lt
    { CairoData CairoDataIndex get /CairoDataIndex CairoDataIndex 1 add def }
    { () } ifelse
} def
/cairo_flush_ascii85_file { cairo_ascii85_file status { cairo_ascii85_file flushfile } if } def
/cairo_image { image cairo_flush_ascii85_file } def
/cairo_imagemask { imagemask cairo_flush_ascii85_file } def
%%EndProlog
%%BeginSetup
%%EndSetup
%%Page: 1 1
%%BeginPageSetup
%%PageBoundingBox: 0 0 384 384
%%EndPageSetup
q 0 0 384 384 rectclip
1 0 0 -1 0 384 cm q
0.901961 0.580392 0.360784 rg
125.574 258.402 m 121.18 254.008 114.062 254.008 109.668 258.402 c 3.297
 364.773 l -1.098 369.168 -1.098 376.285 3.297 380.68 c 7.691 385.074 14.809
 385.074 19.203 380.68 c 125.574 274.309 l 129.969 269.914 129.969 262.797
 125.574 258.402 c h
125.574 258.402 m f
0.8 0.427451 0.239216 rg
19.203 380.68 m 125.574 274.309 l 129.969 269.914 129.969 262.797 125.574
 258.402 c 3.297 380.68 l 7.691 385.074 14.809 385.074 19.203 380.68 c h
19.203 380.68 m f
0.596078 0.85098 0.341176 rg
205.117 178.859 m 205.117 178.855 205.113 178.855 205.113 178.852 c 179.625
 153.375 135.156 153.355 109.668 178.852 c 83.344 205.176 83.344 247.988
 109.668 274.309 c 136.039 300.68 178.742 300.68 205.113 274.309 c 231.434
 247.988 231.438 205.184 205.117 178.859 c h
205.117 178.859 m f
0.4 0.74902 0.223529 rg
205.113 274.309 m 231.434 247.988 231.438 205.184 205.117 178.859 c 109.668
 274.309 l 136.039 300.68 178.742 300.68 205.113 274.309 c h
205.113 274.309 m f
0.952941 0.960784 0.976471 rg
284.672 99.305 m 258.328 72.973 215.504 73.016 189.207 99.305 c 162.906
 125.625 162.906 168.449 189.207 194.762 c 189.211 194.766 l 215.535 221.082
 258.352 221.078 284.672 194.762 c 297.418 182.016 304.449 165.066 304.449
 147.039 c 304.449 129.008 297.418 112.059 284.672 99.305 c h
284.672 99.305 m f
0.882353 0.901961 0.941176 rg
284.672 194.762 m 297.418 182.016 304.449 165.066 304.449 147.039 c 304.449
 129.008 297.418 112.059 284.672 99.305 c 189.211 194.766 l 215.535 221.082
 258.352 221.078 284.672 194.762 c h
284.672 194.762 m f
1 0.454902 0.34902 rg
364.211 19.766 m 337.891 -6.559 295.086 -6.559 268.766 19.766 c 242.395
 46.137 242.367 88.812 268.766 115.211 c 295.09 141.535 337.887 141.535 
364.211 115.211 c 390.582 88.84 390.609 46.164 364.211 19.766 c h
364.211 19.766 m f
0.94902 0.294118 0.235294 rg
364.211 115.211 m 390.582 88.84 390.609 46.164 364.211 19.766 c 268.766
 115.211 l 295.09 141.535 337.887 141.535 364.211 115.211 c h
364.211 115.211 m f
Q Q
showpage
%%Trailer
end
%%EOF
