%!PS-Adobe-3.0 EPSF-3.0
%%Creator: cairo 1.16.0 (https://cairographics.org)
%%CreationDate: Thu Apr  8 07:10:25 2021
%%Pages: 1
%%DocumentData: Clean7Bit
%%LanguageLevel: 2
%%BoundingBox: 0 0 384 384
%%EndComments
%%BeginProlog
50 dict begin
/q { gsave } bind def
/Q { grestore } bind def
/cm { 6 array astore concat } bind def
/w { setlinewidth } bind def
/J { setlinecap } bind def
/j { setlinejoin } bind def
/M { setmiterlimit } bind def
/d { setdash } bind def
/m { moveto } bind def
/l { lineto } bind def
/c { curveto } bind def
/h { closepath } bind def
/re { exch dup neg 3 1 roll 5 3 roll moveto 0 rlineto
      0 exch rlineto 0 rlineto closepath } bind def
/S { stroke } bind def
/f { fill } bind def
/f* { eofill } bind def
/n { newpath } bind def
/W { clip } bind def
/W* { eoclip } bind def
/BT { } bind def
/ET { } bind def
/BDC { mark 3 1 roll /BDC pdfmark } bind def
/EMC { mark /EMC pdfmark } bind def
/cairo_store_point { /cairo_point_y exch def /cairo_point_x exch def } def
/Tj { show currentpoint cairo_store_point } bind def
/TJ {
  {
    dup
    type /stringtype eq
    { show } { -0.001 mul 0 cairo_font_matrix dtransform rmoveto } ifelse
  } forall
  currentpoint cairo_store_point
} bind def
/cairo_selectfont { cairo_font_matrix aload pop pop pop 0 0 6 array astore
    cairo_font exch selectfont cairo_point_x cairo_point_y moveto } bind def
/Tf { pop /cairo_font exch def /cairo_font_matrix where
      { pop cairo_selectfont } if } bind def
/Td { matrix translate cairo_font_matrix matrix concatmatrix dup
      /cairo_font_matrix exch def dup 4 get exch 5 get cairo_store_point
      /cairo_font where { pop cairo_selectfont } if } bind def
/Tm { 2 copy 8 2 roll 6 array astore /cairo_font_matrix exch def
      cairo_store_point /cairo_font where { pop cairo_selectfont } if } bind def
/g { setgray } bind def
/rg { setrgbcolor } bind def
/d1 { setcachedevice } bind def
/cairo_data_source {
  CairoDataIndex CairoData length lt
    { CairoData CairoDataIndex get /CairoDataIndex CairoDataIndex 1 add def }
    { () } ifelse
} def
/cairo_flush_ascii85_file { cairo_ascii85_file status { cairo_ascii85_file flushfile } if } def
/cairo_image { image cairo_flush_ascii85_file } def
/cairo_imagemask { imagemask cairo_flush_ascii85_file } def
%%EndProlog
%%BeginSetup
%%EndSetup
%%Page: 1 1
%%BeginPageSetup
%%PageBoundingBox: 0 0 384 384
%%EndPageSetup
q 0 0 384 384 rectclip
1 0 0 -1 0 384 cm q
0.701961 0.388235 0.282353 rg
146.742 237.262 m 142.344 232.867 135.23 232.867 130.832 237.262 c 3.297
 364.793 l -1.098 369.191 -1.098 376.305 3.297 380.703 c 7.695 385.098 14.812
 385.098 19.207 380.703 c 146.742 253.172 l 151.141 248.773 151.141 241.66
 146.742 237.262 c h
146.742 237.262 m f
0.6 0.25098 0.180392 rg
19.207 380.703 m 146.742 253.172 l 151.141 248.773 151.141 241.66 146.742
 237.262 c 3.297 380.703 l 7.695 385.098 14.812 385.098 19.207 380.703 c
 h
19.207 380.703 m f
0.701961 0.388235 0.282353 rg
325.727 58.277 m 340.609 102.938 l 369.48 125.914 l 383.797 25.656 l 384.801
 18.555 381.98 11.695 377.145 6.859 c 372.293 2.012 365.414 -0.809 358.316
 0.207 c 328.98 4.398 l 319.133 38.504 l h
325.727 58.277 m f
317.773 66.23 m 304.582 26.66 l 278.359 11.633 l 246.98 16.117 l 242.133
 16.801 237.727 19 234.246 22.477 c 225.477 31.25 225.469 45.52 234.246 
54.297 c 321.75 141.801 l 323.953 84.766 l h
317.773 66.23 m f
0.6 0.25098 0.180392 rg
323.953 84.766 m 317.773 66.23 l 281.977 102.027 l 321.75 141.801 l h
323.953 84.766 m f
369.48 125.914 m 383.797 25.656 l 384.801 18.555 381.98 11.695 377.145 
6.859 c 325.727 58.277 l 340.609 102.938 l h
369.48 125.914 m f
1 0.882353 0.298039 rg
218.336 229.309 m 154.695 165.668 l 105.469 183.078 l 91.059 229.309 l 
122.879 261.125 l 154.695 292.945 l 201.43 278.035 l h
218.336 229.309 m f
1 0.74902 0.25098 rg
201.43 278.035 m 218.336 229.309 l 186.516 197.488 l 122.879 261.125 l 
154.695 292.945 l h
201.43 278.035 m f
301.746 149.758 m 301.746 187.035 271.527 217.258 234.246 217.258 c 196.969
 217.258 166.746 187.035 166.746 149.758 c 166.746 112.48 196.969 82.258
 234.246 82.258 c 271.527 82.258 301.746 112.48 301.746 149.758 c h
301.746 149.758 m f
1 0.6 0.2 rg
281.977 197.488 m 308.297 171.168 308.297 128.348 281.977 102.027 c 186.516
 197.488 l 212.836 223.809 255.656 223.809 281.977 197.488 c h
281.977 197.488 m f
0.6 0.25098 0.180392 rg
367.887 137.055 m 369.48 125.914 l 341.637 42.367 l 328.98 4.398 l 278.359
 11.633 l 301.863 82.141 l 321.75 141.805 l 329.707 149.758 l 338.484 158.539
 352.754 158.527 361.527 149.758 c 365.008 146.277 367.203 141.871 367.887
 137.055 c h
367.887 137.055 m f
0.501961 0.168627 0.101961 rg
329.707 149.758 m 338.484 158.535 352.754 158.527 361.527 149.758 c 365.004
 146.277 367.203 141.871 367.887 137.055 c 369.48 125.914 l 341.637 42.367
 l 301.863 82.141 l 321.75 141.805 l h
329.707 149.758 m f
0.952941 0.960784 0.976471 rg
125.441 136.41 m 123.574 134.547 121.121 133.398 118.504 133.156 c 111.129
 132.48 92.145 132.762 75.148 149.758 c 58.023 166.879 57.832 185.812 58.539
 193.152 c 58.793 195.754 59.938 198.188 61.785 200.035 c 91.059 229.309
 l 154.695 165.668 l h
125.441 136.41 m f
0.882353 0.901961 0.941176 rg
250.855 265.461 m 250.598 262.859 249.457 260.43 247.609 258.578 c 218.336
 229.309 l 154.695 292.945 l 183.953 322.203 l 185.785 324.035 188.211 325.188
 190.805 325.449 c 198.152 326.18 217.094 326.012 234.246 308.855 c 251.367
 291.734 251.562 272.805 250.855 265.461 c h
250.855 265.461 m f
Q Q
showpage
%%Trailer
end
%%EOF
