%!PS-Adobe-3.0 EPSF-3.0
%%Creator: cairo 1.16.0 (https://cairographics.org)
%%CreationDate: Thu Apr  8 07:10:38 2021
%%Pages: 1
%%DocumentData: Clean7Bit
%%LanguageLevel: 2
%%BoundingBox: 0 0 384 384
%%EndComments
%%BeginProlog
50 dict begin
/q { gsave } bind def
/Q { grestore } bind def
/cm { 6 array astore concat } bind def
/w { setlinewidth } bind def
/J { setlinecap } bind def
/j { setlinejoin } bind def
/M { setmiterlimit } bind def
/d { setdash } bind def
/m { moveto } bind def
/l { lineto } bind def
/c { curveto } bind def
/h { closepath } bind def
/re { exch dup neg 3 1 roll 5 3 roll moveto 0 rlineto
      0 exch rlineto 0 rlineto closepath } bind def
/S { stroke } bind def
/f { fill } bind def
/f* { eofill } bind def
/n { newpath } bind def
/W { clip } bind def
/W* { eoclip } bind def
/BT { } bind def
/ET { } bind def
/BDC { mark 3 1 roll /BDC pdfmark } bind def
/EMC { mark /EMC pdfmark } bind def
/cairo_store_point { /cairo_point_y exch def /cairo_point_x exch def } def
/Tj { show currentpoint cairo_store_point } bind def
/TJ {
  {
    dup
    type /stringtype eq
    { show } { -0.001 mul 0 cairo_font_matrix dtransform rmoveto } ifelse
  } forall
  currentpoint cairo_store_point
} bind def
/cairo_selectfont { cairo_font_matrix aload pop pop pop 0 0 6 array astore
    cairo_font exch selectfont cairo_point_x cairo_point_y moveto } bind def
/Tf { pop /cairo_font exch def /cairo_font_matrix where
      { pop cairo_selectfont } if } bind def
/Td { matrix translate cairo_font_matrix matrix concatmatrix dup
      /cairo_font_matrix exch def dup 4 get exch 5 get cairo_store_point
      /cairo_font where { pop cairo_selectfont } if } bind def
/Tm { 2 copy 8 2 roll 6 array astore /cairo_font_matrix exch def
      cairo_store_point /cairo_font where { pop cairo_selectfont } if } bind def
/g { setgray } bind def
/rg { setrgbcolor } bind def
/d1 { setcachedevice } bind def
/cairo_data_source {
  CairoDataIndex CairoData length lt
    { CairoData CairoDataIndex get /CairoDataIndex CairoDataIndex 1 add def }
    { () } ifelse
} def
/cairo_flush_ascii85_file { cairo_ascii85_file status { cairo_ascii85_file flushfile } if } def
/cairo_image { image cairo_flush_ascii85_file } def
/cairo_imagemask { imagemask cairo_flush_ascii85_file } def
%%EndProlog
%%BeginSetup
%%EndSetup
%%Page: 1 1
%%BeginPageSetup
%%PageBoundingBox: 0 0 384 384
%%EndPageSetup
q 0 0 384 384 rectclip
1 0 0 -1 0 384 cm q
1 0.454902 0.34902 rg
384 192 m 384 297.523 297.523 384 192 384 c 192 0 l 297.523 0 384 86.477
 384 192 c h
384 192 m f
0.94902 0.294118 0.235294 rg
192 0 m 86.477 0 0 86.477 0 192 c 0 297.523 86.477 384 192 384 c 297.523
 384 384 297.523 384 192 c 384 86.477 297.523 0 192 0 c h
192 0 m f
0.952941 0.960784 0.976471 rg
361.5 192 m 361.5 285.613 285.613 361.5 192 361.5 c 98.387 361.5 22.5 285.613
 22.5 192 c 22.5 98.387 98.387 22.5 192 22.5 c 285.613 22.5 361.5 98.387
 361.5 192 c h
361.5 192 m f
0.882353 0.901961 0.941176 rg
361.5 192 m 361.5 285.148 285.148 361.5 192 361.5 c 192 22.5 l 285.148 
22.5 361.5 98.852 361.5 192 c h
361.5 192 m f
0.701961 0.388235 0.282353 rg
270.75 169.5 m 270.75 152.516 269.062 137.582 266.066 124.5 c 240.789 115.812
 l 258.875 102 l 244.117 66.742 217.703 50.227 192 46.566 c 188.223 46.027
 184.457 45.75 180.75 45.75 c 143.711 45.75 126.613 68.938 118.992 102 c
 139.707 112.934 l 115.316 124.5 l 113.75 138.711 113.25 153.953 113.25 
169.5 c 113.25 173.109 113.285 176.891 113.352 180.75 c 136.281 192.473 
l 114.176 203.25 l 115.176 221.652 117.188 241.133 120.816 259.5 c 146.262
 271.379 l 126.391 282 l 136.137 314.051 152.707 338.25 180.75 338.25 c 
184.586 338.25 188.32 337.617 192 336.668 c 213.457 331.133 232.105 310.293
 245.863 282 c 228.707 269.184 l 255.246 259.5 l 261.48 241.934 265.984 
222.734 268.48 203.25 c 246.867 192.957 l 270.418 180.75 l 270.582 176.992
 270.75 173.227 270.75 169.5 c h
270.75 169.5 m f
0.6 0.25098 0.180392 rg
245.863 282 m 228.707 269.184 l 255.246 259.5 l 261.48 241.934 265.984 
222.734 268.48 203.25 c 246.867 192.957 l 270.418 180.75 l 270.582 176.992
 270.75 173.227 270.75 169.5 c 270.75 152.516 269.062 137.582 266.066 124.5
 c 240.789 115.812 l 258.875 102 l 244.117 66.742 217.703 50.227 192 46.566
 c 192 336.668 l 213.457 331.133 232.105 310.293 245.863 282 c h
245.863 282 m f
1 0.882353 0.298039 rg
90.75 124.5 m 90.75 130.715 85.715 135.75 79.5 135.75 c 73.285 135.75 68.25
 130.715 68.25 124.5 c 68.25 118.285 73.285 113.25 79.5 113.25 c 85.715 
113.25 90.75 118.285 90.75 124.5 c h
90.75 124.5 m f
1 0.74902 0.25098 rg
315.75 259.5 m 315.75 265.715 310.715 270.75 304.5 270.75 c 298.285 270.75
 293.25 265.715 293.25 259.5 c 293.25 253.285 298.285 248.25 304.5 248.25
 c 310.715 248.25 315.75 253.285 315.75 259.5 c h
315.75 259.5 m f
270.75 304.5 m 270.75 310.715 265.715 315.75 259.5 315.75 c 253.285 315.75
 248.25 310.715 248.25 304.5 c 248.25 298.285 253.285 293.25 259.5 293.25
 c 265.715 293.25 270.75 298.285 270.75 304.5 c h
270.75 304.5 m f
293.25 79.5 m 293.25 85.715 288.215 90.75 282 90.75 c 275.785 90.75 270.75
 85.715 270.75 79.5 c 270.75 73.285 275.785 68.25 282 68.25 c 288.215 68.25
 293.25 73.285 293.25 79.5 c h
293.25 79.5 m f
1 0.882353 0.298039 rg
90.75 237 m 90.75 243.215 85.715 248.25 79.5 248.25 c 73.285 248.25 68.25
 243.215 68.25 237 c 68.25 230.785 73.285 225.75 79.5 225.75 c 85.715 225.75
 90.75 230.785 90.75 237 c h
90.75 237 m f
113.25 304.5 m 113.25 310.715 108.215 315.75 102 315.75 c 95.785 315.75
 90.75 310.715 90.75 304.5 c 90.75 298.285 95.785 293.25 102 293.25 c 108.215
 293.25 113.25 298.285 113.25 304.5 c h
113.25 304.5 m f
0.596078 0.85098 0.341176 rg
49.047 199.953 m 44.652 195.559 44.652 188.441 49.047 184.047 c 71.547 
161.547 l 75.941 157.152 83.059 157.152 87.453 161.547 c 91.848 165.941 
91.848 173.059 87.453 177.453 c 64.953 199.953 l 60.559 204.348 53.441 204.348
 49.047 199.953 c h
49.047 199.953 m f
0.4 0.74902 0.223529 rg
285.297 143.703 m 280.902 139.309 280.902 132.191 285.297 127.797 c 307.797
 105.297 l 312.191 100.902 319.309 100.902 323.703 105.297 c 328.098 109.691
 328.098 116.809 323.703 121.203 c 301.203 143.703 l 296.809 148.098 289.691
 148.098 285.297 143.703 c h
285.297 143.703 m f
319.047 222.453 m 296.547 199.953 l 292.152 195.559 292.152 188.441 296.547
 184.047 c 300.941 179.652 308.059 179.652 312.453 184.047 c 334.953 206.547
 l 339.348 210.941 339.348 218.059 334.953 222.453 c 330.559 226.848 323.441
 226.848 319.047 222.453 c h
319.047 222.453 m f
0.6 0.25098 0.180392 rg
120.816 259.5 m 122.359 267.293 124.211 274.82 126.391 282 c 245.863 282
 l 249.305 274.914 252.449 267.383 255.246 259.5 c h
120.816 259.5 m f
266.066 124.5 m 264.176 116.25 261.727 108.805 258.875 102 c 118.992 102
 l 117.359 109.082 116.184 116.641 115.316 124.5 c h
266.066 124.5 m f
192 180.75 m 113.352 180.75 l 113.473 187.914 113.754 195.488 114.176 203.25
 c 268.48 203.25 l 269.438 195.754 270.086 188.242 270.418 180.75 c h
192 180.75 m f
0.501961 0.168627 0.101961 rg
258.875 102 m 192 102 l 192 124.5 l 266.066 124.5 l 264.176 116.25 261.727
 108.805 258.875 102 c h
258.875 102 m f
270.418 180.75 m 192 180.75 l 192 203.25 l 268.48 203.25 l 269.438 195.754
 270.086 188.242 270.418 180.75 c h
270.418 180.75 m f
255.246 259.5 m 192 259.5 l 192 282 l 245.863 282 l 249.305 274.914 252.449
 267.383 255.246 259.5 c h
255.246 259.5 m f
Q Q
showpage
%%Trailer
end
%%EOF
