%!PS-Adobe-3.0 EPSF-3.0
%%Creator: cairo 1.16.0 (https://cairographics.org)
%%CreationDate: Thu Apr  8 07:10:30 2021
%%Pages: 1
%%DocumentData: Clean7Bit
%%LanguageLevel: 2
%%BoundingBox: 0 0 384 384
%%EndComments
%%BeginProlog
50 dict begin
/q { gsave } bind def
/Q { grestore } bind def
/cm { 6 array astore concat } bind def
/w { setlinewidth } bind def
/J { setlinecap } bind def
/j { setlinejoin } bind def
/M { setmiterlimit } bind def
/d { setdash } bind def
/m { moveto } bind def
/l { lineto } bind def
/c { curveto } bind def
/h { closepath } bind def
/re { exch dup neg 3 1 roll 5 3 roll moveto 0 rlineto
      0 exch rlineto 0 rlineto closepath } bind def
/S { stroke } bind def
/f { fill } bind def
/f* { eofill } bind def
/n { newpath } bind def
/W { clip } bind def
/W* { eoclip } bind def
/BT { } bind def
/ET { } bind def
/BDC { mark 3 1 roll /BDC pdfmark } bind def
/EMC { mark /EMC pdfmark } bind def
/cairo_store_point { /cairo_point_y exch def /cairo_point_x exch def } def
/Tj { show currentpoint cairo_store_point } bind def
/TJ {
  {
    dup
    type /stringtype eq
    { show } { -0.001 mul 0 cairo_font_matrix dtransform rmoveto } ifelse
  } forall
  currentpoint cairo_store_point
} bind def
/cairo_selectfont { cairo_font_matrix aload pop pop pop 0 0 6 array astore
    cairo_font exch selectfont cairo_point_x cairo_point_y moveto } bind def
/Tf { pop /cairo_font exch def /cairo_font_matrix where
      { pop cairo_selectfont } if } bind def
/Td { matrix translate cairo_font_matrix matrix concatmatrix dup
      /cairo_font_matrix exch def dup 4 get exch 5 get cairo_store_point
      /cairo_font where { pop cairo_selectfont } if } bind def
/Tm { 2 copy 8 2 roll 6 array astore /cairo_font_matrix exch def
      cairo_store_point /cairo_font where { pop cairo_selectfont } if } bind def
/g { setgray } bind def
/rg { setrgbcolor } bind def
/d1 { setcachedevice } bind def
/cairo_data_source {
  CairoDataIndex CairoData length lt
    { CairoData CairoDataIndex get /CairoDataIndex CairoDataIndex 1 add def }
    { () } ifelse
} def
/cairo_flush_ascii85_file { cairo_ascii85_file status { cairo_ascii85_file flushfile } if } def
/cairo_image { image cairo_flush_ascii85_file } def
/cairo_imagemask { imagemask cairo_flush_ascii85_file } def
%%EndProlog
%%BeginSetup
%%EndSetup
%%Page: 1 1
%%BeginPageSetup
%%PageBoundingBox: 0 0 384 384
%%EndPageSetup
q 0 0 384 384 rectclip
1 0 0 -1 0 384 cm q
1 0.454902 0.34902 rg
192 0 m 86.477 0 0 86.477 0 192 c 0 297.523 86.477 384 192 384 c 297.523
 384 384 297.523 384 192 c 384 86.477 297.523 0 192 0 c h
192 0 m f
0.94902 0.294118 0.235294 rg
384 192 m 384 297.523 297.523 384 192 384 c 192 0 l 297.523 0 384 86.477
 384 192 c h
384 192 m f
1 0.882353 0.298039 rg
361.5 192 m 361.5 285.613 285.613 361.5 192 361.5 c 98.387 361.5 22.5 285.613
 22.5 192 c 22.5 98.387 98.387 22.5 192 22.5 c 285.613 22.5 361.5 98.387
 361.5 192 c h
361.5 192 m f
1 0.74902 0.25098 rg
361.5 192 m 361.5 285.148 285.148 361.5 192 361.5 c 192 22.5 l 285.148 
22.5 361.5 98.852 361.5 192 c h
361.5 192 m f
0.952941 0.960784 0.976471 rg
259.5 68.25 m 192 68.25 l 185.699 68.25 180.75 73.199 180.75 79.5 c 180.75
 147 l 180.75 153.301 185.699 158.25 192 158.25 c 259.5 158.25 l 265.801
 158.25 270.75 153.301 270.75 147 c 270.75 79.5 l 270.75 73.199 265.801 
68.25 259.5 68.25 c h
259.5 68.25 m f
147 203.25 m 102 203.25 l 95.781 203.25 90.75 198.219 90.75 192 c 90.75
 147 l 90.75 140.781 95.781 135.75 102 135.75 c 147 135.75 l 153.219 135.75
 158.25 140.781 158.25 147 c 158.25 192 l 158.25 198.219 153.219 203.25 
147 203.25 c h
147 203.25 m f
0.882353 0.901961 0.941176 rg
304.5 270.75 m 259.5 270.75 l 253.281 270.75 248.25 265.719 248.25 259.5
 c 248.25 214.5 l 248.25 208.281 253.281 203.25 259.5 203.25 c 304.5 203.25
 l 310.719 203.25 315.75 208.281 315.75 214.5 c 315.75 259.5 l 315.75 265.719
 310.719 270.75 304.5 270.75 c h
304.5 270.75 m f
0.952941 0.960784 0.976471 rg
192 225.75 m 124.5 225.75 l 118.199 225.75 113.25 230.699 113.25 237 c 
113.25 304.5 l 113.25 310.801 118.199 315.75 124.5 315.75 c 192 315.75 l
 198.301 315.75 203.25 310.801 203.25 304.5 c 203.25 237 l 203.25 230.699
 198.301 225.75 192 225.75 c h
192 225.75 m f
0.596078 0.85098 0.341176 rg
94.047 109.953 m 89.652 105.559 89.652 98.441 94.047 94.047 c 116.547 71.547
 l 120.941 67.152 128.059 67.152 132.453 71.547 c 136.848 75.941 136.848
 83.059 132.453 87.453 c 109.953 109.953 l 105.559 114.348 98.441 114.348
 94.047 109.953 c h
94.047 109.953 m f
0.4 0.74902 0.223529 rg
319.047 177.453 m 296.547 154.953 l 292.152 150.559 292.152 143.441 296.547
 139.047 c 300.941 134.652 308.059 134.652 312.453 139.047 c 334.953 161.547
 l 339.348 165.941 339.348 173.059 334.953 177.453 c 330.559 181.848 323.441
 181.848 319.047 177.453 c h
319.047 177.453 m f
229.047 334.953 m 224.652 330.559 224.652 323.441 229.047 319.047 c 251.547
 296.547 l 255.941 292.152 263.059 292.152 267.453 296.547 c 271.848 300.941
 271.848 308.059 267.453 312.453 c 244.953 334.953 l 240.559 339.348 233.441
 339.348 229.047 334.953 c h
229.047 334.953 m f
0.596078 0.85098 0.341176 rg
71.547 244.953 m 49.047 222.453 l 44.652 218.059 44.652 210.941 49.047 
206.547 c 53.441 202.152 60.559 202.152 64.953 206.547 c 87.453 229.047 
l 91.848 233.441 91.848 240.559 87.453 244.953 c 83.059 249.348 75.941 249.348
 71.547 244.953 c h
71.547 244.953 m f
0.4 0.74902 0.223529 rg
225.75 192 m 225.75 198.215 220.715 203.25 214.5 203.25 c 208.285 203.25
 203.25 198.215 203.25 192 c 203.25 185.785 208.285 180.75 214.5 180.75 
c 220.715 180.75 225.75 185.785 225.75 192 c h
225.75 192 m f
0.596078 0.85098 0.341176 rg
68.25 147 m 68.25 153.215 63.215 158.25 57 158.25 c 50.785 158.25 45.75
 153.215 45.75 147 c 45.75 140.785 50.785 135.75 57 135.75 c 63.215 135.75
 68.25 140.785 68.25 147 c h
68.25 147 m f
0.882353 0.901961 0.941176 rg
203.25 237 m 203.25 304.5 l 203.25 310.801 198.301 315.75 192 315.75 c 
192 225.75 l 198.301 225.75 203.25 230.699 203.25 237 c h
203.25 237 m f
270.75 79.5 m 270.75 147 l 270.75 153.301 265.801 158.25 259.5 158.25 c
 192 158.25 l 192 68.25 l 259.5 68.25 l 265.801 68.25 270.75 73.199 270.75
 79.5 c h
270.75 79.5 m f
Q Q
showpage
%%Trailer
end
%%EOF
