%!PS-Adobe-3.0 EPSF-3.0
%%Creator: cairo 1.16.0 (https://cairographics.org)
%%CreationDate: Thu Apr  8 07:10:40 2021
%%Pages: 1
%%DocumentData: Clean7Bit
%%LanguageLevel: 2
%%BoundingBox: 0 12 384 372
%%EndComments
%%BeginProlog
50 dict begin
/q { gsave } bind def
/Q { grestore } bind def
/cm { 6 array astore concat } bind def
/w { setlinewidth } bind def
/J { setlinecap } bind def
/j { setlinejoin } bind def
/M { setmiterlimit } bind def
/d { setdash } bind def
/m { moveto } bind def
/l { lineto } bind def
/c { curveto } bind def
/h { closepath } bind def
/re { exch dup neg 3 1 roll 5 3 roll moveto 0 rlineto
      0 exch rlineto 0 rlineto closepath } bind def
/S { stroke } bind def
/f { fill } bind def
/f* { eofill } bind def
/n { newpath } bind def
/W { clip } bind def
/W* { eoclip } bind def
/BT { } bind def
/ET { } bind def
/BDC { mark 3 1 roll /BDC pdfmark } bind def
/EMC { mark /EMC pdfmark } bind def
/cairo_store_point { /cairo_point_y exch def /cairo_point_x exch def } def
/Tj { show currentpoint cairo_store_point } bind def
/TJ {
  {
    dup
    type /stringtype eq
    { show } { -0.001 mul 0 cairo_font_matrix dtransform rmoveto } ifelse
  } forall
  currentpoint cairo_store_point
} bind def
/cairo_selectfont { cairo_font_matrix aload pop pop pop 0 0 6 array astore
    cairo_font exch selectfont cairo_point_x cairo_point_y moveto } bind def
/Tf { pop /cairo_font exch def /cairo_font_matrix where
      { pop cairo_selectfont } if } bind def
/Td { matrix translate cairo_font_matrix matrix concatmatrix dup
      /cairo_font_matrix exch def dup 4 get exch 5 get cairo_store_point
      /cairo_font where { pop cairo_selectfont } if } bind def
/Tm { 2 copy 8 2 roll 6 array astore /cairo_font_matrix exch def
      cairo_store_point /cairo_font where { pop cairo_selectfont } if } bind def
/g { setgray } bind def
/rg { setrgbcolor } bind def
/d1 { setcachedevice } bind def
/cairo_data_source {
  CairoDataIndex CairoData length lt
    { CairoData CairoDataIndex get /CairoDataIndex CairoDataIndex 1 add def }
    { () } ifelse
} def
/cairo_flush_ascii85_file { cairo_ascii85_file status { cairo_ascii85_file flushfile } if } def
/cairo_image { image cairo_flush_ascii85_file } def
/cairo_imagemask { imagemask cairo_flush_ascii85_file } def
%%EndProlog
%%BeginSetup
%%EndSetup
%%Page: 1 1
%%BeginPageSetup
%%PageBoundingBox: 0 12 384 372
%%EndPageSetup
q 0 12 384 360 rectclip
1 0 0 -1 0 384 cm q
0.952941 0.960784 0.976471 rg
361.273 227.551 m 338.773 362.551 l 337.875 367.949 333.148 372 327.75 
372 c 56.25 372 l 50.852 372 46.125 367.949 45.227 362.551 c 22.727 227.551
 l h
361.273 227.551 m f
0.882353 0.901961 0.941176 rg
361.273 227.551 m 338.773 362.551 l 337.875 367.949 333.148 372 327.75 
372 c 192 372 l 192 227.551 l h
361.273 227.551 m f
0.301961 0.368627 0.501961 rg
294 45.75 m 294 52.051 289.051 57 282.75 57 c 11.25 57 l 4.949 57 0 52.051
 0 45.75 c 0 39.449 4.949 34.5 11.25 34.5 c 282.75 34.5 l 289.051 34.5 294
 39.449 294 45.75 c h
294 45.75 m f
327.75 68.25 m 327.75 102 l 11.25 102 l 4.949 102 0 97.051 0 90.75 c 0 
84.449 4.949 79.5 11.25 79.5 c 271.5 79.5 l 294 68.25 l h
327.75 68.25 m f
0.239216 0.270588 0.4 rg
282.75 57 m 192 57 l 192 34.5 l 282.75 34.5 l 289.051 34.5 294 39.449 294
 45.75 c 294 52.051 289.051 57 282.75 57 c h
282.75 57 m f
327.75 102 m 192 102 l 192 79.5 l 271.5 79.5 l 294 68.25 l 327.75 68.25
 l h
327.75 102 m f
0.882353 0.901961 0.941176 rg
384 225.75 m 384 232.051 379.051 237 372.75 237 c 11.25 237 l 4.949 237
 0 232.051 0 225.75 c 0 219.449 4.949 214.5 11.25 214.5 c 372.75 214.5 l
 379.051 214.5 384 219.449 384 225.75 c h
384 225.75 m f
203.25 270.75 m 203.25 315.75 l 203.25 322.051 198.301 327 192 327 c 185.699
 327 180.75 322.051 180.75 315.75 c 180.75 270.75 l 180.75 264.449 185.699
 259.5 192 259.5 c 198.301 259.5 203.25 264.449 203.25 270.75 c h
203.25 270.75 m f
0.811765 0.843137 0.901961 rg
237 327 m 230.781 327 225.75 321.969 225.75 315.75 c 225.75 270.75 l 225.75
 264.531 230.781 259.5 237 259.5 c 243.219 259.5 248.25 264.531 248.25 270.75
 c 248.25 315.75 l 248.25 321.969 243.219 327 237 327 c h
237 327 m f
282 327 m 275.781 327 270.75 321.969 270.75 315.75 c 270.75 270.75 l 270.75
 264.531 275.781 259.5 282 259.5 c 288.219 259.5 293.25 264.531 293.25 270.75
 c 293.25 315.75 l 293.25 321.969 288.219 327 282 327 c h
282 327 m f
0.882353 0.901961 0.941176 rg
147 327 m 140.781 327 135.75 321.969 135.75 315.75 c 135.75 270.75 l 135.75
 264.531 140.781 259.5 147 259.5 c 153.219 259.5 158.25 264.531 158.25 270.75
 c 158.25 315.75 l 158.25 321.969 153.219 327 147 327 c h
147 327 m f
102 327 m 95.781 327 90.75 321.969 90.75 315.75 c 90.75 270.75 l 90.75 
264.531 95.781 259.5 102 259.5 c 108.219 259.5 113.25 264.531 113.25 270.75
 c 113.25 315.75 l 113.25 321.969 108.219 327 102 327 c h
102 327 m f
0.701961 0.388235 0.282353 rg
339 169.5 m 326.586 169.5 316.5 159.402 316.5 147 c 316.5 79.5 l 271.5 
79.5 l 259.086 79.5 249 69.402 249 57 c 249 44.598 259.086 34.5 271.5 34.5
 c 271.5 22.098 281.586 12 294 12 c 302.305 12 309.578 16.527 313.488 23.25
 c 319.508 23.25 l 323.422 16.527 330.695 12 339 12 c 351.414 12 361.5 22.098
 361.5 34.5 c 373.914 34.5 384 44.598 384 57 c 384 69.402 373.914 79.5 361.5
 79.5 c 361.5 147 l 361.5 159.402 351.414 169.5 339 169.5 c h
339 169.5 m f
0.811765 0.843137 0.901961 rg
203.25 270.75 m 203.25 315.75 l 203.25 322.051 198.301 327 192 327 c 192
 259.5 l 198.301 259.5 203.25 264.449 203.25 270.75 c h
203.25 270.75 m f
384 225.75 m 384 232.051 379.051 237 372.75 237 c 192 237 l 192 214.5 l
 372.75 214.5 l 379.051 214.5 384 219.449 384 225.75 c h
384 225.75 m f
Q Q
showpage
%%Trailer
end
%%EOF
