%!PS-Adobe-3.0 EPSF-3.0
%%Creator: cairo 1.16.0 (https://cairographics.org)
%%CreationDate: Thu Apr  8 07:10:23 2021
%%Pages: 1
%%DocumentData: Clean7Bit
%%LanguageLevel: 2
%%BoundingBox: 0 0 384 384
%%EndComments
%%BeginProlog
50 dict begin
/q { gsave } bind def
/Q { grestore } bind def
/cm { 6 array astore concat } bind def
/w { setlinewidth } bind def
/J { setlinecap } bind def
/j { setlinejoin } bind def
/M { setmiterlimit } bind def
/d { setdash } bind def
/m { moveto } bind def
/l { lineto } bind def
/c { curveto } bind def
/h { closepath } bind def
/re { exch dup neg 3 1 roll 5 3 roll moveto 0 rlineto
      0 exch rlineto 0 rlineto closepath } bind def
/S { stroke } bind def
/f { fill } bind def
/f* { eofill } bind def
/n { newpath } bind def
/W { clip } bind def
/W* { eoclip } bind def
/BT { } bind def
/ET { } bind def
/BDC { mark 3 1 roll /BDC pdfmark } bind def
/EMC { mark /EMC pdfmark } bind def
/cairo_store_point { /cairo_point_y exch def /cairo_point_x exch def } def
/Tj { show currentpoint cairo_store_point } bind def
/TJ {
  {
    dup
    type /stringtype eq
    { show } { -0.001 mul 0 cairo_font_matrix dtransform rmoveto } ifelse
  } forall
  currentpoint cairo_store_point
} bind def
/cairo_selectfont { cairo_font_matrix aload pop pop pop 0 0 6 array astore
    cairo_font exch selectfont cairo_point_x cairo_point_y moveto } bind def
/Tf { pop /cairo_font exch def /cairo_font_matrix where
      { pop cairo_selectfont } if } bind def
/Td { matrix translate cairo_font_matrix matrix concatmatrix dup
      /cairo_font_matrix exch def dup 4 get exch 5 get cairo_store_point
      /cairo_font where { pop cairo_selectfont } if } bind def
/Tm { 2 copy 8 2 roll 6 array astore /cairo_font_matrix exch def
      cairo_store_point /cairo_font where { pop cairo_selectfont } if } bind def
/g { setgray } bind def
/rg { setrgbcolor } bind def
/d1 { setcachedevice } bind def
/cairo_data_source {
  CairoDataIndex CairoData length lt
    { CairoData CairoDataIndex get /CairoDataIndex CairoDataIndex 1 add def }
    { () } ifelse
} def
/cairo_flush_ascii85_file { cairo_ascii85_file status { cairo_ascii85_file flushfile } if } def
/cairo_image { image cairo_flush_ascii85_file } def
/cairo_imagemask { imagemask cairo_flush_ascii85_file } def
%%EndProlog
%%BeginSetup
%%EndSetup
%%Page: 1 1
%%BeginPageSetup
%%PageBoundingBox: 0 0 384 384
%%EndPageSetup
q 0 0 384 384 rectclip
1 0 0 -1 0 384 cm q
0.6 0.25098 0.180392 rg
293.418 61.922 m 292.473 55.781 296.691 50.035 302.82 49.09 c 325.871 45.543
 l 331.957 44.695 337.758 48.805 338.703 54.945 c 339.648 61.086 335.43 
66.832 329.297 67.777 c 306.25 71.324 l 300.105 72.273 294.363 68.062 293.418
 61.922 c h
293.418 61.922 m f
0.701961 0.388235 0.282353 rg
212.82 62.953 m 192.035 66.16 l 13.812 93.508 l 7.684 94.453 3.465 100.199
 4.41 106.34 c 5.355 112.48 11.098 116.688 17.242 115.742 c 192.035 88.922
 l 216.25 85.191 l 222.379 84.246 226.598 78.5 225.652 72.359 c 224.711 
66.219 218.844 62.066 212.82 62.953 c h
212.82 62.953 m f
0.6 0.25098 0.180392 rg
225.652 72.359 m 224.711 66.219 218.844 62.066 212.82 62.953 c 192.035 
66.16 l 192.035 88.922 l 216.25 85.191 l 222.379 84.246 226.598 78.5 225.652
 72.359 c h
225.652 72.359 m f
0.4 0.74902 0.223529 rg
169.535 113.25 m 147.035 113.25 l 109.574 113.25 77.098 139.883 69.801 
176.574 c 143.609 191.395 l 166.875 176.895 180.785 151.891 180.785 124.5
 c 180.785 118.281 175.754 113.25 169.535 113.25 c h
169.535 113.25 m f
0.596078 0.85098 0.341176 rg
33.785 135.75 m 11.285 135.75 l 5.066 135.75 0.035 140.781 0.035 147 c 
0.035 177.301 18.473 205.25 45.871 218.215 c 99.465 169.906 l 84.742 148.516
 59.715 135.75 33.785 135.75 c h
33.785 135.75 m f
1 0.74902 0.25098 rg
219.566 293.25 m 223.348 282.641 225.785 271.391 225.785 259.5 c 225.785
 203.668 180.367 158.25 124.535 158.25 c 68.703 158.25 23.285 203.668 23.285
 259.5 c 23.285 271.391 25.723 282.641 29.504 293.25 c h
219.566 293.25 m f
1 0.6 0.2 rg
195.387 293.25 m 200.301 282.98 203.285 271.625 203.285 259.5 c 203.285
 216.082 167.953 180.75 124.535 180.75 c 81.117 180.75 45.785 216.082 45.785
 259.5 c 45.785 271.625 48.77 282.98 53.684 293.25 c h
195.387 293.25 m f
1 0.74902 0.25098 rg
169.25 293.25 m 176.387 283.82 180.785 272.211 180.785 259.5 c 180.785 
228.484 155.559 203.25 124.535 203.25 c 93.512 203.25 68.285 228.484 68.285
 259.5 c 68.285 272.211 72.684 283.82 79.82 293.25 c h
169.25 293.25 m f
1 0.6 0.2 rg
158.285 259.5 m 158.285 278.141 143.176 293.25 124.535 293.25 c 105.895
 293.25 90.785 278.141 90.785 259.5 c 90.785 240.859 105.895 225.75 124.535
 225.75 c 143.176 225.75 158.285 240.859 158.285 259.5 c h
158.285 259.5 m f
203.285 11.25 112.5 192 re f
1 0.882353 0.298039 rg
225.785 11.25 22.5 192 re f
270.785 11.25 22.5 192 re f
248.285 158.25 m 227.703 158.25 208.648 163.613 192.035 172.336 c 158.574
 189.898 135.785 222.191 135.785 259.5 c 135.785 293.25 l 360.785 293.25
 l 360.785 259.5 l 360.785 203.668 310.316 158.25 248.285 158.25 c h
248.285 158.25 m f
1 0.74902 0.25098 rg
360.785 259.5 m 360.785 203.668 310.312 158.25 248.285 158.25 c 227.703
 158.25 208.648 163.613 192.035 172.336 c 192.035 293.25 l 360.785 293.25
 l h
360.785 259.5 m f
248.285 180.75 m 226.895 180.75 207.492 187.582 192.035 198.523 c 171.621
 212.973 158.285 234.793 158.285 259.5 c 158.285 293.25 l 338.285 293.25
 l 338.285 259.5 l 338.285 216.082 297.922 180.75 248.285 180.75 c h
248.285 180.75 m f
1 0.6 0.2 rg
338.285 259.5 m 338.285 216.082 297.922 180.75 248.285 180.75 c 226.895
 180.75 207.492 187.582 192.035 198.523 c 192.035 293.25 l 338.285 293.25
 l h
338.285 259.5 m f
1 0.882353 0.298039 rg
248.285 203.25 m 224.805 203.25 204.133 213.32 192.035 228.52 c 184.957
 237.418 180.785 248.051 180.785 259.5 c 180.785 293.25 l 315.785 293.25
 l 315.785 259.5 l 315.785 228.484 285.508 203.25 248.285 203.25 c h
248.285 203.25 m f
1 0.74902 0.25098 rg
315.785 259.5 m 315.785 228.484 285.508 203.25 248.285 203.25 c 224.805
 203.25 204.133 213.32 192.035 228.52 c 192.035 293.25 l 315.785 293.25 
l h
315.785 259.5 m f
1 0.6 0.2 rg
203.285 293.25 m 293.285 293.25 l 293.285 259.5 l 293.285 240.891 273.094
 225.75 248.285 225.75 c 223.477 225.75 203.285 240.891 203.285 259.5 c 
h
203.285 293.25 m f
0.701961 0.388235 0.282353 rg
327.035 0 m 11.285 0 l 5.066 0 0.035 5.031 0.035 11.25 c 0.035 17.469 5.066
 22.5 11.285 22.5 c 327.035 22.5 l 333.254 22.5 338.285 17.469 338.285 11.25
 c 338.285 5.031 333.254 0 327.035 0 c h
327.035 0 m f
0.6 0.25098 0.180392 rg
338.285 11.25 m 338.285 5.031 333.254 0 327.035 0 c 192.035 0 l 192.035
 22.5 l 327.035 22.5 l 333.254 22.5 338.285 17.469 338.285 11.25 c h
338.285 11.25 m f
1 0.454902 0.34902 rg
372.785 270.75 m 11.285 270.75 l 4.309 270.75 -0.863 276.824 0.262 283.574
 c 6.109 324.973 41.512 354.074 92.137 360.375 c 101.359 361.273 109.012
 367.574 111.934 376.348 c 113.512 380.848 117.785 384 122.734 384 c 259.535
 384 l 265.836 384 270.785 378.602 270.785 372.301 c 270.785 366.449 275.512
 361.5 281.359 361.273 c 337.16 357.898 377.512 327.898 383.809 283.574 
c 384.934 276.824 379.762 270.75 372.785 270.75 c h
372.785 270.75 m f
0.94902 0.294118 0.235294 rg
383.809 283.574 m 377.512 327.898 337.16 357.898 281.359 361.273 c 275.512
 361.5 270.785 366.449 270.785 372.301 c 270.785 378.602 265.836 384 259.535
 384 c 192.035 384 l 192.035 270.75 l 372.785 270.75 l 379.762 270.75 384.934
 276.824 383.809 283.574 c h
383.809 283.574 m f
Q Q
showpage
%%Trailer
end
%%EOF
