%!PS-Adobe-3.0 EPSF-3.0
%%Creator: cairo 1.16.0 (https://cairographics.org)
%%CreationDate: Thu Apr  8 07:10:28 2021
%%Pages: 1
%%DocumentData: Clean7Bit
%%LanguageLevel: 2
%%BoundingBox: 0 57 384 327
%%EndComments
%%BeginProlog
50 dict begin
/q { gsave } bind def
/Q { grestore } bind def
/cm { 6 array astore concat } bind def
/w { setlinewidth } bind def
/J { setlinecap } bind def
/j { setlinejoin } bind def
/M { setmiterlimit } bind def
/d { setdash } bind def
/m { moveto } bind def
/l { lineto } bind def
/c { curveto } bind def
/h { closepath } bind def
/re { exch dup neg 3 1 roll 5 3 roll moveto 0 rlineto
      0 exch rlineto 0 rlineto closepath } bind def
/S { stroke } bind def
/f { fill } bind def
/f* { eofill } bind def
/n { newpath } bind def
/W { clip } bind def
/W* { eoclip } bind def
/BT { } bind def
/ET { } bind def
/BDC { mark 3 1 roll /BDC pdfmark } bind def
/EMC { mark /EMC pdfmark } bind def
/cairo_store_point { /cairo_point_y exch def /cairo_point_x exch def } def
/Tj { show currentpoint cairo_store_point } bind def
/TJ {
  {
    dup
    type /stringtype eq
    { show } { -0.001 mul 0 cairo_font_matrix dtransform rmoveto } ifelse
  } forall
  currentpoint cairo_store_point
} bind def
/cairo_selectfont { cairo_font_matrix aload pop pop pop 0 0 6 array astore
    cairo_font exch selectfont cairo_point_x cairo_point_y moveto } bind def
/Tf { pop /cairo_font exch def /cairo_font_matrix where
      { pop cairo_selectfont } if } bind def
/Td { matrix translate cairo_font_matrix matrix concatmatrix dup
      /cairo_font_matrix exch def dup 4 get exch 5 get cairo_store_point
      /cairo_font where { pop cairo_selectfont } if } bind def
/Tm { 2 copy 8 2 roll 6 array astore /cairo_font_matrix exch def
      cairo_store_point /cairo_font where { pop cairo_selectfont } if } bind def
/g { setgray } bind def
/rg { setrgbcolor } bind def
/d1 { setcachedevice } bind def
/cairo_data_source {
  CairoDataIndex CairoData length lt
    { CairoData CairoDataIndex get /CairoDataIndex CairoDataIndex 1 add def }
    { () } ifelse
} def
/cairo_flush_ascii85_file { cairo_ascii85_file status { cairo_ascii85_file flushfile } if } def
/cairo_image { image cairo_flush_ascii85_file } def
/cairo_imagemask { imagemask cairo_flush_ascii85_file } def
%%EndProlog
%%BeginSetup
%%EndSetup
%%Page: 1 1
%%BeginPageSetup
%%PageBoundingBox: 0 57 384 327
%%EndPageSetup
q 0 57 384 270 rectclip
1 0 0 -1 0 384 cm q
0.301961 0.368627 0.501961 rg
327 57 m 259.5 57 l 228.477 57 203.25 82.234 203.25 113.25 c 203.25 180.75
 l 203.25 211.766 228.477 237 259.5 237 c 278.445 248.25 l 307.934 248.25
 l 327 237 l 358.023 237 384 211.766 384 180.75 c 384 113.25 l 384 82.234
 358.023 57 327 57 c h
327 57 m f
0.239216 0.270588 0.4 rg
327 237 m 358.023 237 384 211.766 384 180.75 c 384 113.25 l 384 82.234 
358.023 57 327 57 c 293.25 57 l 293.25 248.25 l 307.934 248.25 l h
327 237 m f
0.952941 0.960784 0.976471 rg
327 79.5 m 259.5 79.5 l 240.891 79.5 225.75 94.641 225.75 113.25 c 225.75
 180.75 l 225.75 199.359 240.891 214.5 259.5 214.5 c 327 214.5 l 345.609
 214.5 361.5 199.359 361.5 180.75 c 361.5 113.25 l 361.5 94.641 345.609 
79.5 327 79.5 c h
327 79.5 m f
0.882353 0.901961 0.941176 rg
361.5 180.75 m 361.5 113.25 l 361.5 94.641 345.609 79.5 327 79.5 c 293.25
 79.5 l 293.25 214.5 l 327 214.5 l 345.609 214.5 361.5 199.359 361.5 180.75
 c h
361.5 180.75 m f
0.301961 0.368627 0.501961 rg
124.5 57 m 57 57 l 25.977 57 0 82.234 0 113.25 c 0 180.75 l 0 211.766 25.977
 237 57 237 c 75.945 248.25 l 105.434 248.25 l 124.5 237 l 155.523 237 180.75
 211.766 180.75 180.75 c 180.75 113.25 l 180.75 82.234 155.523 57 124.5 
57 c h
124.5 57 m f
0.239216 0.270588 0.4 rg
124.5 237 m 155.523 237 180.75 211.766 180.75 180.75 c 180.75 113.25 l 
180.75 82.234 155.523 57 124.5 57 c 90.75 57 l 90.75 248.25 l 105.434 248.25
 l h
124.5 237 m f
0.952941 0.960784 0.976471 rg
124.5 79.5 m 57 79.5 l 38.391 79.5 22.5 94.641 22.5 113.25 c 22.5 180.75
 l 22.5 199.359 38.391 214.5 57 214.5 c 124.5 214.5 l 143.109 214.5 158.25
 199.359 158.25 180.75 c 158.25 113.25 l 158.25 94.641 143.109 79.5 124.5
 79.5 c h
124.5 79.5 m f
0.882353 0.901961 0.941176 rg
158.25 180.75 m 158.25 113.25 l 158.25 94.641 143.109 79.5 124.5 79.5 c
 90.75 79.5 l 90.75 214.5 l 124.5 214.5 l 143.109 214.5 158.25 199.359 158.25
 180.75 c h
158.25 180.75 m f
1 0.74902 0.25098 rg
372.75 237 m 11.25 237 l 4.949 237 0 241.949 0 248.25 c 0 270.75 l 0 277.051
 4.949 282 11.25 282 c 57 282 l 57 315.75 l 57 322.051 61.949 327 68.25 
327 c 90.75 327 l 97.051 327 102 322.051 102 315.75 c 102 282 l 282 282 
l 282 315.75 l 282 322.051 286.949 327 293.25 327 c 315.75 327 l 322.051
 327 327 322.051 327 315.75 c 327 282 l 372.75 282 l 379.051 282 384 277.051
 384 270.75 c 384 248.25 l 384 241.949 379.051 237 372.75 237 c h
372.75 237 m f
1 0.6 0.2 rg
384 248.25 m 384 270.75 l 384 277.051 379.051 282 372.75 282 c 327 282 
l 327 315.75 l 327 322.051 322.051 327 315.75 327 c 293.25 327 l 286.949
 327 282 322.051 282 315.75 c 282 282 l 192 282 l 192 237 l 372.75 237 l
 379.051 237 384 241.949 384 248.25 c h
384 248.25 m f
1 0.454902 0.34902 rg
135.75 147 m 135.75 171.852 115.602 192 90.75 192 c 65.898 192 45.75 171.852
 45.75 147 c 45.75 122.148 65.898 102 90.75 102 c 115.602 102 135.75 122.148
 135.75 147 c h
135.75 147 m f
0.94902 0.294118 0.235294 rg
135.75 147 m 135.75 122.184 115.559 102 90.75 102 c 90.75 192 l 115.559
 192 135.75 171.816 135.75 147 c h
135.75 147 m f
0.596078 0.85098 0.341176 rg
339.613 139.047 m 301.203 100.637 l 299.008 98.441 296.129 97.34 293.25
 97.34 c 290.371 97.34 287.492 98.441 285.297 100.637 c 246.887 139.047 
l 242.492 143.441 242.492 150.559 246.887 154.953 c 285.297 193.363 l 287.492
 195.559 290.371 196.66 293.25 196.66 c 296.129 196.66 299.008 195.559 301.203
 193.363 c 339.613 154.953 l 344.008 150.559 344.008 143.441 339.613 139.047
 c h
339.613 139.047 m f
0.4 0.74902 0.223529 rg
339.613 154.953 m 344.008 150.559 344.008 143.441 339.613 139.047 c 301.203
 100.637 l 299.008 98.441 296.129 97.34 293.25 97.34 c 293.25 196.656 l 
296.129 196.656 299.008 195.559 301.203 193.359 c h
339.613 154.953 m f
Q Q
showpage
%%Trailer
end
%%EOF
