%!PS-Adobe-3.0 EPSF-3.0
%%Creator: cairo 1.16.0 (https://cairographics.org)
%%CreationDate: Thu Apr  8 07:10:38 2021
%%Pages: 1
%%DocumentData: Clean7Bit
%%LanguageLevel: 2
%%BoundingBox: 0 0 384 384
%%EndComments
%%BeginProlog
50 dict begin
/q { gsave } bind def
/Q { grestore } bind def
/cm { 6 array astore concat } bind def
/w { setlinewidth } bind def
/J { setlinecap } bind def
/j { setlinejoin } bind def
/M { setmiterlimit } bind def
/d { setdash } bind def
/m { moveto } bind def
/l { lineto } bind def
/c { curveto } bind def
/h { closepath } bind def
/re { exch dup neg 3 1 roll 5 3 roll moveto 0 rlineto
      0 exch rlineto 0 rlineto closepath } bind def
/S { stroke } bind def
/f { fill } bind def
/f* { eofill } bind def
/n { newpath } bind def
/W { clip } bind def
/W* { eoclip } bind def
/BT { } bind def
/ET { } bind def
/BDC { mark 3 1 roll /BDC pdfmark } bind def
/EMC { mark /EMC pdfmark } bind def
/cairo_store_point { /cairo_point_y exch def /cairo_point_x exch def } def
/Tj { show currentpoint cairo_store_point } bind def
/TJ {
  {
    dup
    type /stringtype eq
    { show } { -0.001 mul 0 cairo_font_matrix dtransform rmoveto } ifelse
  } forall
  currentpoint cairo_store_point
} bind def
/cairo_selectfont { cairo_font_matrix aload pop pop pop 0 0 6 array astore
    cairo_font exch selectfont cairo_point_x cairo_point_y moveto } bind def
/Tf { pop /cairo_font exch def /cairo_font_matrix where
      { pop cairo_selectfont } if } bind def
/Td { matrix translate cairo_font_matrix matrix concatmatrix dup
      /cairo_font_matrix exch def dup 4 get exch 5 get cairo_store_point
      /cairo_font where { pop cairo_selectfont } if } bind def
/Tm { 2 copy 8 2 roll 6 array astore /cairo_font_matrix exch def
      cairo_store_point /cairo_font where { pop cairo_selectfont } if } bind def
/g { setgray } bind def
/rg { setrgbcolor } bind def
/d1 { setcachedevice } bind def
/cairo_data_source {
  CairoDataIndex CairoData length lt
    { CairoData CairoDataIndex get /CairoDataIndex CairoDataIndex 1 add def }
    { () } ifelse
} def
/cairo_flush_ascii85_file { cairo_ascii85_file status { cairo_ascii85_file flushfile } if } def
/cairo_image { image cairo_flush_ascii85_file } def
/cairo_imagemask { imagemask cairo_flush_ascii85_file } def
%%EndProlog
%%BeginSetup
%%EndSetup
%%Page: 1 1
%%BeginPageSetup
%%PageBoundingBox: 0 0 384 384
%%EndPageSetup
q 0 0 384 384 rectclip
1 0 0 -1 0 384 cm q
0.94902 0.294118 0.235294 rg
339.762 107.867 m 335.367 103.473 335.367 96.352 339.762 91.957 c 358.199
 73.523 l 362.578 69.168 362.617 62.035 358.199 57.613 c 326.383 25.797 
l 322.012 21.453 314.93 21.355 310.473 25.789 c 292.082 44.18 l 287.688 
48.57 280.566 48.57 276.176 44.18 c 271.781 39.785 271.781 32.652 276.176
 28.27 c 294.566 9.891 l 307.652 -3.246 329.051 -3.348 342.289 9.891 c 374.105
 41.707 l 387.328 54.93 387.266 76.281 374.105 89.441 c 355.672 107.863 
l 351.277 112.262 344.156 112.262 339.762 107.867 c h
339.762 107.867 m f
1 0.454902 0.34902 rg
41.711 374.113 m 9.895 342.297 l -3.328 329.07 -3.266 307.719 9.895 294.559
 c 28.328 276.137 l 32.723 271.742 39.844 271.742 44.238 276.137 c 48.633
 280.531 48.633 287.652 44.238 292.043 c 25.801 310.48 l 21.422 314.836 
21.383 321.969 25.801 326.387 c 57.617 358.203 l 61.988 362.551 69.07 362.648
 73.527 358.215 c 91.918 339.824 l 96.312 335.43 103.434 335.43 107.824 
339.824 c 112.219 344.219 112.219 351.348 107.824 355.734 c 89.434 374.113
 l 76.297 387.297 54.895 387.293 41.711 374.113 c h
41.711 374.113 m f
0.239216 0.270588 0.4 rg
192 11.25 m 142.375 11.25 97.375 32.188 64.781 64.781 c 32.188 97.375 11.25
 142.375 11.25 192 c 11.25 291.25 92.75 372.75 192 372.75 c 241.625 372.75
 286.625 351.812 319.219 319.219 c 351.812 286.625 372.75 241.625 372.75
 192 c 372.75 92.75 291.25 11.25 192 11.25 c h
192 11.25 m f
0.180392 0.180392 0.301961 rg
192 11.25 m 142.375 11.25 97.375 32.188 64.781 64.781 c 319.219 319.219
 l 351.812 286.625 372.75 241.625 372.75 192 c 372.75 92.75 291.25 11.25
 192 11.25 c h
192 11.25 m f
0.301961 0.368627 0.501961 rg
192 0 m 139.297 0 91.484 22.211 56.848 56.848 c 22.211 91.48 0 139.293 
0 192 c 0 297.164 87.152 384 192 384 c 244.727 384 292.535 361.801 327.168
 327.168 c 361.801 292.539 384 244.727 384 192 c 384 87.672 297.645 0 192
 0 c h
28.555 236.133 m 147.867 355.445 l 90.281 339.805 44.195 293.719 28.555
 236.133 c h
192 361.5 m 189.773 361.5 187.609 361.254 185.402 361.168 c 22.832 198.598
 l 22.746 196.391 22.5 194.227 22.5 192 c 22.5 174.652 25.895 157.91 30.777
 142.148 c 241.852 353.223 l 226.09 358.105 209.348 361.5 192 361.5 c h
264.566 344.121 m 39.879 119.434 l 46.566 105.477 55.062 92.59 65.148 81.066
 c 302.941 318.84 l 291.418 328.93 278.527 337.434 264.566 344.121 c h
355.445 147.867 m 236.133 28.555 l 293.719 44.195 339.805 90.281 355.445
 147.867 c h
318.852 302.934 m 81.059 65.16 l 92.582 55.066 105.477 46.566 119.438 39.879
 c 344.117 264.566 l 337.434 278.523 328.938 291.41 318.852 302.934 c h
142.156 30.777 m 157.918 25.891 174.652 22.5 192 22.5 c 194.227 22.5 196.391
 22.746 198.598 22.832 c 361.168 185.402 l 361.254 187.609 361.5 189.773
 361.5 192 c 361.5 209.348 358.105 226.09 353.223 241.852 c h
142.156 30.777 m f
0.239216 0.270588 0.4 rg
192 0 m 139.297 0 91.484 22.211 56.848 56.848 c 327.168 327.168 l 361.801
 292.539 384 244.727 384 192 c 384 87.672 297.645 0 192 0 c h
355.445 147.867 m 236.133 28.555 l 293.719 44.195 339.805 90.281 355.445
 147.867 c h
318.852 302.934 m 81.059 65.16 l 92.582 55.066 105.477 46.566 119.438 39.879
 c 344.117 264.566 l 337.434 278.523 328.938 291.41 318.852 302.934 c h
142.156 30.777 m 157.918 25.891 174.652 22.5 192 22.5 c 194.227 22.5 196.391
 22.746 198.598 22.832 c 361.168 185.402 l 361.254 187.609 361.5 189.773
 361.5 192 c 361.5 209.348 358.105 226.09 353.223 241.852 c h
142.156 30.777 m f
0.701961 0.388235 0.282353 rg
183.137 183.137 m 212.48 146.82 237.102 93.891 207.91 64.723 c 172.887 
29.672 123.805 53.375 88.598 88.586 c 88.594 88.586 88.594 88.59 88.59 88.59
 c 35.797 141.367 41.645 184.828 64.715 207.906 c 96.02 239.184 124.449 
243.621 168.137 199.953 c 173.121 194.973 178.188 189.262 183.137 183.137
 c h
183.137 183.137 m f
319.289 176.09 m 296.195 153.02 267.258 132.672 215.863 184.047 c 210.879
 189.027 205.812 194.738 200.863 200.863 c 171.52 237.18 146.898 290.105
 176.09 319.277 c 210.418 353.637 259.043 331.773 295.402 295.414 c 295.41
 295.41 l 348.203 242.633 342.359 199.172 319.289 176.09 c h
319.289 176.09 m f
0.6 0.25098 0.180392 rg
319.289 176.09 m 296.195 153.02 267.258 132.672 215.863 184.047 c 210.879
 189.027 205.812 194.738 200.863 200.863 c 295.41 295.41 l 348.203 242.633
 342.359 199.172 319.289 176.09 c h
319.289 176.09 m f
207.91 64.723 m 172.887 29.676 123.805 53.379 88.598 88.586 c 88.594 88.586
 88.594 88.59 88.59 88.59 c 183.137 183.137 l 212.48 146.82 237.102 93.891
 207.91 64.723 c h
207.91 64.723 m f
0.501961 0.168627 0.101961 rg
271.5 251.25 m 265.281 251.25 260.25 246.219 260.25 240 c 260.25 207.75
 l 260.25 201.531 265.281 196.5 271.5 196.5 c 277.719 196.5 282.75 201.531
 282.75 207.75 c 282.75 240 l 282.75 246.219 277.719 251.25 271.5 251.25
 c h
271.5 251.25 m f
0.6 0.25098 0.180392 rg
223.5 298.5 m 217.281 298.5 212.25 293.469 212.25 287.25 c 212.25 255.75
 l 212.25 249.531 217.281 244.5 223.5 244.5 c 229.719 244.5 234.75 249.531
 234.75 255.75 c 234.75 287.25 l 234.75 293.469 229.719 298.5 223.5 298.5
 c h
223.5 298.5 m f
0.501961 0.168627 0.101961 rg
160.5 139.5 m 154.281 139.5 149.25 134.469 149.25 128.25 c 149.25 96.75
 l 149.25 90.531 154.281 85.5 160.5 85.5 c 166.719 85.5 171.75 90.531 171.75
 96.75 c 171.75 128.25 l 171.75 134.469 166.719 139.5 160.5 139.5 c h
160.5 139.5 m f
0.6 0.25098 0.180392 rg
112.5 187.5 m 106.281 187.5 101.25 182.469 101.25 176.25 c 101.25 144 l
 101.25 137.781 106.281 132.75 112.5 132.75 c 118.719 132.75 123.75 137.781
 123.75 144 c 123.75 176.25 l 123.75 182.469 118.719 187.5 112.5 187.5 c
 h
112.5 187.5 m f
Q Q
showpage
%%Trailer
end
%%EOF
