%!PS-Adobe-3.0 EPSF-3.0
%%Creator: cairo 1.16.0 (https://cairographics.org)
%%CreationDate: Thu Apr  8 07:10:31 2021
%%Pages: 1
%%DocumentData: Clean7Bit
%%LanguageLevel: 2
%%BoundingBox: 0 0 384 384
%%EndComments
%%BeginProlog
50 dict begin
/q { gsave } bind def
/Q { grestore } bind def
/cm { 6 array astore concat } bind def
/w { setlinewidth } bind def
/J { setlinecap } bind def
/j { setlinejoin } bind def
/M { setmiterlimit } bind def
/d { setdash } bind def
/m { moveto } bind def
/l { lineto } bind def
/c { curveto } bind def
/h { closepath } bind def
/re { exch dup neg 3 1 roll 5 3 roll moveto 0 rlineto
      0 exch rlineto 0 rlineto closepath } bind def
/S { stroke } bind def
/f { fill } bind def
/f* { eofill } bind def
/n { newpath } bind def
/W { clip } bind def
/W* { eoclip } bind def
/BT { } bind def
/ET { } bind def
/BDC { mark 3 1 roll /BDC pdfmark } bind def
/EMC { mark /EMC pdfmark } bind def
/cairo_store_point { /cairo_point_y exch def /cairo_point_x exch def } def
/Tj { show currentpoint cairo_store_point } bind def
/TJ {
  {
    dup
    type /stringtype eq
    { show } { -0.001 mul 0 cairo_font_matrix dtransform rmoveto } ifelse
  } forall
  currentpoint cairo_store_point
} bind def
/cairo_selectfont { cairo_font_matrix aload pop pop pop 0 0 6 array astore
    cairo_font exch selectfont cairo_point_x cairo_point_y moveto } bind def
/Tf { pop /cairo_font exch def /cairo_font_matrix where
      { pop cairo_selectfont } if } bind def
/Td { matrix translate cairo_font_matrix matrix concatmatrix dup
      /cairo_font_matrix exch def dup 4 get exch 5 get cairo_store_point
      /cairo_font where { pop cairo_selectfont } if } bind def
/Tm { 2 copy 8 2 roll 6 array astore /cairo_font_matrix exch def
      cairo_store_point /cairo_font where { pop cairo_selectfont } if } bind def
/g { setgray } bind def
/rg { setrgbcolor } bind def
/d1 { setcachedevice } bind def
/cairo_data_source {
  CairoDataIndex CairoData length lt
    { CairoData CairoDataIndex get /CairoDataIndex CairoDataIndex 1 add def }
    { () } ifelse
} def
/cairo_flush_ascii85_file { cairo_ascii85_file status { cairo_ascii85_file flushfile } if } def
/cairo_image { image cairo_flush_ascii85_file } def
/cairo_imagemask { imagemask cairo_flush_ascii85_file } def
%%EndProlog
%%BeginSetup
%%EndSetup
%%Page: 1 1
%%BeginPageSetup
%%PageBoundingBox: 0 0 384 384
%%EndPageSetup
q 0 0 384 384 rectclip
1 0 0 -1 0 384 cm q
0.701961 0.388235 0.282353 rg
192 67.5 m 11.25 67.5 l 5.035 67.5 0 62.465 0 56.25 c 0 50.039 5.035 45
 11.25 45 c 192 45 l 198.211 45 203.25 50.039 203.25 56.25 c 203.25 62.465
 198.211 67.5 192 67.5 c h
192 67.5 m f
0.6 0.25098 0.180392 rg
327 67.5 m 259.5 67.5 l 253.285 67.5 248.25 62.465 248.25 56.25 c 248.25
 50.039 253.285 45 259.5 45 c 327 45 l 333.211 45 338.25 50.039 338.25 56.25
 c 338.25 62.465 333.211 67.5 327 67.5 c h
327 67.5 m f
1 0.74902 0.25098 rg
158.25 11.25 112.5 169.5 re f
1 0.6 0.2 rg
214.5 11.25 56.25 169.5 re f
1 0.882353 0.298039 rg
180.75 11.25 22.5 169.5 re f
1 0.74902 0.25098 rg
225.75 11.25 22.5 169.5 re f
0.882353 0.901961 0.941176 rg
382.109 230.758 m 336.359 163.258 l 317.637 175.742 l 363.387 243.242 l
 366.871 248.445 373.852 249.785 378.988 246.359 c 384.152 242.91 385.559
 235.934 382.109 230.758 c h
382.109 230.758 m f
0.952941 0.960784 0.976471 rg
92.641 163.258 m 47.641 230.758 l 44.191 235.934 45.598 242.91 50.762 246.359
 c 55.895 249.785 62.879 248.445 66.359 243.242 c 111.359 175.742 l h
92.641 163.258 m f
1 0.454902 0.34902 rg
335.395 161.996 m 285.297 197.922 l 143.703 197.922 l 93.605 161.996 l 
91.477 164.383 90.465 167.566 90.816 170.742 c 113.316 373.992 l 113.953
 379.695 118.766 384 124.5 384 c 304.5 384 l 310.234 384 315.047 379.695
 315.684 373.992 c 338.184 170.742 l 338.535 167.566 337.523 164.379 335.395
 161.996 c h
335.395 161.996 m f
0.94902 0.294118 0.235294 rg
315.684 373.992 m 338.184 170.742 l 338.535 167.566 337.523 164.383 335.395
 161.996 c 285.297 197.922 l 214.5 197.922 l 214.5 384 l 304.5 384 l 310.234
 384 315.047 379.691 315.684 373.992 c h
315.684 373.992 m f
0.701961 0.388235 0.282353 rg
338.25 11.25 m 338.25 17.551 333.301 22.5 327 22.5 c 11.25 22.5 l 4.949
 22.5 0 17.551 0 11.25 c 0 4.949 4.949 0 11.25 0 c 327 0 l 333.301 0 338.25
 4.949 338.25 11.25 c h
338.25 11.25 m f
0.6 0.25098 0.180392 rg
338.25 11.25 m 338.25 17.551 333.301 22.5 327 22.5 c 214.5 22.5 l 214.5
 0 l 327 0 l 333.301 0 338.25 4.949 338.25 11.25 c h
338.25 11.25 m f
0.952941 0.960784 0.976471 rg
327 158.25 m 102 158.25 l 98.793 158.25 95.762 159.613 93.605 161.996 c
 143.703 242.922 l 145.75 246.234 149.371 248.25 153.266 248.25 c 275.734
 248.25 l 279.629 248.25 283.25 246.234 285.297 242.922 c 335.395 161.996
 l 333.238 159.613 330.207 158.25 327 158.25 c h
327 158.25 m f
0.882353 0.901961 0.941176 rg
285.297 242.922 m 335.395 161.996 l 333.238 159.613 330.207 158.25 327 
158.25 c 214.5 158.25 l 214.5 248.25 l 275.734 248.25 l 279.629 248.25 283.246
 246.234 285.297 242.922 c h
285.297 242.922 m f
Q Q
showpage
%%Trailer
end
%%EOF
