%!PS-Adobe-3.0 EPSF-3.0
%%Creator: cairo 1.16.0 (https://cairographics.org)
%%CreationDate: Thu Apr  8 07:10:34 2021
%%Pages: 1
%%DocumentData: Clean7Bit
%%LanguageLevel: 2
%%BoundingBox: 0 9 384 375
%%EndComments
%%BeginProlog
50 dict begin
/q { gsave } bind def
/Q { grestore } bind def
/cm { 6 array astore concat } bind def
/w { setlinewidth } bind def
/J { setlinecap } bind def
/j { setlinejoin } bind def
/M { setmiterlimit } bind def
/d { setdash } bind def
/m { moveto } bind def
/l { lineto } bind def
/c { curveto } bind def
/h { closepath } bind def
/re { exch dup neg 3 1 roll 5 3 roll moveto 0 rlineto
      0 exch rlineto 0 rlineto closepath } bind def
/S { stroke } bind def
/f { fill } bind def
/f* { eofill } bind def
/n { newpath } bind def
/W { clip } bind def
/W* { eoclip } bind def
/BT { } bind def
/ET { } bind def
/BDC { mark 3 1 roll /BDC pdfmark } bind def
/EMC { mark /EMC pdfmark } bind def
/cairo_store_point { /cairo_point_y exch def /cairo_point_x exch def } def
/Tj { show currentpoint cairo_store_point } bind def
/TJ {
  {
    dup
    type /stringtype eq
    { show } { -0.001 mul 0 cairo_font_matrix dtransform rmoveto } ifelse
  } forall
  currentpoint cairo_store_point
} bind def
/cairo_selectfont { cairo_font_matrix aload pop pop pop 0 0 6 array astore
    cairo_font exch selectfont cairo_point_x cairo_point_y moveto } bind def
/Tf { pop /cairo_font exch def /cairo_font_matrix where
      { pop cairo_selectfont } if } bind def
/Td { matrix translate cairo_font_matrix matrix concatmatrix dup
      /cairo_font_matrix exch def dup 4 get exch 5 get cairo_store_point
      /cairo_font where { pop cairo_selectfont } if } bind def
/Tm { 2 copy 8 2 roll 6 array astore /cairo_font_matrix exch def
      cairo_store_point /cairo_font where { pop cairo_selectfont } if } bind def
/g { setgray } bind def
/rg { setrgbcolor } bind def
/d1 { setcachedevice } bind def
/cairo_data_source {
  CairoDataIndex CairoData length lt
    { CairoData CairoDataIndex get /CairoDataIndex CairoDataIndex 1 add def }
    { () } ifelse
} def
/cairo_flush_ascii85_file { cairo_ascii85_file status { cairo_ascii85_file flushfile } if } def
/cairo_image { image cairo_flush_ascii85_file } def
/cairo_imagemask { imagemask cairo_flush_ascii85_file } def
%%EndProlog
%%BeginSetup
%%EndSetup
%%Page: 1 1
%%BeginPageSetup
%%PageBoundingBox: 0 9 384 375
%%EndPageSetup
q 0 9 384 366 rectclip
1 0 0 -1 0 384 cm q
1 0.74902 0.25098 rg
157 77.699 m 158.531 41.047 l 125.172 27.844 93.238 32.988 68.281 60.266
 c 33.223 98.586 22.781 170.398 65.965 224.195 c h
157 77.699 m f
0.952941 0.960784 0.976471 rg
346.793 168.852 m 339.906 146.055 l 357.645 147.879 l 362.633 134.156 364.23
 119.344 360.949 104.785 c 363.938 102.895 366.824 100.773 369.426 98.168
 c 385.375 82.219 391.379 54.34 371.105 34.062 c 355.816 18.773 l 349.973
 12.93 339.879 15.164 337.188 23.172 c 332.57 37.023 314.895 41.492 304.324
 30.926 c 282.875 9.473 251.547 4.555 225.09 15.324 c 228.535 34.684 l 205.098
 27.152 l 196.074 18.133 181.449 18.133 172.43 27.152 c 158.535 41.047 l
 157.598 95.184 l 279.391 216.977 l 333.805 215.797 l 346.793 202.805 l 
356.168 193.43 356.168 178.227 346.793 168.852 c h
346.793 168.852 m f
0.882353 0.901961 0.941176 rg
333.801 215.797 m 346.793 202.809 l 356.168 193.43 356.168 178.227 346.793
 168.852 c 339.906 146.055 l 357.645 147.879 l 362.633 134.156 364.23 119.344
 360.949 104.785 c 363.938 102.895 366.824 100.773 369.426 98.168 c 385.375
 82.219 391.379 54.34 371.105 34.062 c 355.816 18.773 l 218.5 156.09 l 279.391
 216.98 l h
333.801 215.797 m f
1 0.6 0.2 rg
305.664 245.395 m 171.262 298.789 l 189.672 317.199 261.609 351.629 290.586
 322.652 c 303.156 310.082 308.094 284.82 305.664 245.395 c h
305.664 245.395 m f
1 0.882353 0.298039 rg
155.555 326.211 m 156.766 312.445 168.09 302.082 181.91 302.09 c 253.254
 302.098 297.066 265.23 333.801 215.797 c 296.863 198.594 255.621 176.316
 226.945 147.645 c 198.18 118.879 175.609 77.668 158.531 41.047 c 108.594
 78.156 72.492 121.828 72.5 192.68 c 72.508 206.5 62.145 217.824 48.379 
219.039 c 10.246 224.449 l 4.094 225.008 -0.469 230.41 0.039 236.582 c 0.164
 238.125 2.703 261.777 13.285 288.051 c 38.172 290.363 l 23.441 308.387 
l 28.469 316.996 34.305 325.43 41.73 332.859 c 49.16 340.285 57.594 346.121
 66.203 351.148 c 84.227 336.418 l 86.539 361.305 l 112.812 371.887 136.465
 374.02 138.008 374.148 c 144.184 374.652 149.582 370.094 150.141 363.941
 c h
155.555 326.211 m f
1 0.74902 0.25098 rg
84.227 336.418 m 86.539 361.305 l 112.816 371.887 136.465 374.02 138.008
 374.148 c 144.184 374.652 149.582 370.094 150.141 363.941 c 155.555 326.211
 l 156.766 312.445 168.09 302.082 181.91 302.09 c 253.254 302.098 297.066
 265.23 333.801 215.797 c 296.863 198.594 255.621 176.316 226.945 147.645
 c 41.73 332.859 l 49.16 340.285 57.594 346.121 66.203 351.148 c h
84.227 336.418 m f
68.316 281.57 m 66.312 275.715 59.988 272.496 54.086 274.453 c 13.285 288.051
 l 16 294.793 19.5 301.625 23.441 308.387 c 61.199 295.805 l 67.09 293.828
 70.281 287.465 68.316 281.57 c h
68.316 281.57 m f
1 0.6 0.2 rg
93.02 306.273 m 87.121 304.309 80.762 307.504 78.789 313.391 c 66.203 351.148
 l 72.965 355.094 79.797 358.59 86.539 361.305 c 100.137 320.508 l 102.094
 314.602 98.906 308.277 93.02 306.273 c h
93.02 306.273 m f
0.701961 0.388235 0.282353 rg
158.645 131.734 m 158.645 137.949 153.609 142.984 147.395 142.984 c 141.184
 142.984 136.145 137.949 136.145 131.734 c 136.145 125.52 141.184 120.484
 147.395 120.484 c 153.609 120.484 158.645 125.52 158.645 131.734 c h
158.645 131.734 m f
1 0.74902 0.25098 rg
155.352 251.059 m 150.953 246.66 143.84 246.66 139.441 251.059 c 135.051
 255.449 127.914 255.441 123.531 251.059 c 119.148 246.676 119.145 239.539
 123.531 235.148 c 127.93 230.75 127.93 223.637 123.531 219.238 c 119.133
 214.844 112.02 214.844 107.621 219.238 c 94.461 232.398 94.461 253.809 
107.621 266.969 c 120.781 280.129 142.191 280.129 155.352 266.969 c 159.75
 262.57 159.75 255.457 155.352 251.059 c h
155.352 251.059 m f
234.902 235.148 m 230.504 230.75 223.387 230.75 218.992 235.148 c 214.602
 239.539 207.461 239.531 203.082 235.148 c 198.699 230.766 198.691 223.629
 203.082 219.238 c 207.477 214.844 207.477 207.727 203.082 203.328 c 198.684
 198.934 191.566 198.934 187.172 203.328 c 182.781 207.719 175.645 207.711
 171.262 203.328 c 166.879 198.949 166.871 191.809 171.262 187.418 c 175.66
 183.023 175.66 175.906 171.262 171.512 c 166.863 167.113 159.75 167.113
 155.352 171.512 c 142.191 184.668 142.191 206.078 155.352 219.238 c 161.484
 225.375 169.422 228.527 177.469 228.941 c 177.883 236.992 181.039 244.926
 187.172 251.059 c 200.332 264.219 221.742 264.219 234.902 251.059 c 239.297
 246.664 239.297 239.547 234.902 235.148 c h
234.902 235.148 m f
1 0.6 0.2 rg
155.352 266.969 m 159.75 262.57 159.75 255.457 155.352 251.059 c 150.953
 246.66 143.84 246.66 139.441 251.059 c 135.051 255.449 127.914 255.441 
123.531 251.059 c 107.621 266.969 l 120.781 280.129 142.191 280.129 155.352
 266.969 c h
155.352 266.969 m f
187.172 251.059 m 200.332 264.219 221.742 264.219 234.902 251.059 c 239.297
 246.66 239.297 239.547 234.902 235.148 c 230.504 230.754 223.387 230.75
 218.992 235.148 c 214.602 239.539 207.461 239.531 203.082 235.148 c 198.699
 230.766 198.691 223.629 203.082 219.238 c 207.477 214.844 207.477 207.727
 203.082 203.328 c 198.684 198.934 191.566 198.934 187.172 203.328 c 182.781
 207.719 175.645 207.711 171.262 203.328 c 155.352 219.238 l 161.484 225.375
 169.422 228.527 177.469 228.941 c 177.883 236.992 181.035 244.926 187.172
 251.059 c h
187.172 251.059 m f
0.882353 0.901961 0.941176 rg
244.445 66.504 m 248.84 70.898 255.965 70.898 260.355 66.504 c 264.75 62.109
 264.75 54.988 260.355 50.594 c 225.09 15.328 l 218 18.211 211.188 21.984
 205.098 27.152 c h
244.445 66.504 m f
0.811765 0.843137 0.901961 rg
308.086 114.234 m 303.695 118.625 303.695 125.75 308.086 130.145 c 346.793
 168.852 l 351.578 162.422 354.957 155.266 357.645 147.879 c 323.996 114.234
 l 319.602 109.84 312.48 109.84 308.086 114.234 c h
308.086 114.234 m f
Q Q
showpage
%%Trailer
end
%%EOF
