%!PS-Adobe-3.0 EPSF-3.0
%%Creator: cairo 1.16.0 (https://cairographics.org)
%%CreationDate: Thu Apr  8 07:10:22 2021
%%Pages: 1
%%DocumentData: Clean7Bit
%%LanguageLevel: 2
%%BoundingBox: 0 0 384 384
%%EndComments
%%BeginProlog
50 dict begin
/q { gsave } bind def
/Q { grestore } bind def
/cm { 6 array astore concat } bind def
/w { setlinewidth } bind def
/J { setlinecap } bind def
/j { setlinejoin } bind def
/M { setmiterlimit } bind def
/d { setdash } bind def
/m { moveto } bind def
/l { lineto } bind def
/c { curveto } bind def
/h { closepath } bind def
/re { exch dup neg 3 1 roll 5 3 roll moveto 0 rlineto
      0 exch rlineto 0 rlineto closepath } bind def
/S { stroke } bind def
/f { fill } bind def
/f* { eofill } bind def
/n { newpath } bind def
/W { clip } bind def
/W* { eoclip } bind def
/BT { } bind def
/ET { } bind def
/BDC { mark 3 1 roll /BDC pdfmark } bind def
/EMC { mark /EMC pdfmark } bind def
/cairo_store_point { /cairo_point_y exch def /cairo_point_x exch def } def
/Tj { show currentpoint cairo_store_point } bind def
/TJ {
  {
    dup
    type /stringtype eq
    { show } { -0.001 mul 0 cairo_font_matrix dtransform rmoveto } ifelse
  } forall
  currentpoint cairo_store_point
} bind def
/cairo_selectfont { cairo_font_matrix aload pop pop pop 0 0 6 array astore
    cairo_font exch selectfont cairo_point_x cairo_point_y moveto } bind def
/Tf { pop /cairo_font exch def /cairo_font_matrix where
      { pop cairo_selectfont } if } bind def
/Td { matrix translate cairo_font_matrix matrix concatmatrix dup
      /cairo_font_matrix exch def dup 4 get exch 5 get cairo_store_point
      /cairo_font where { pop cairo_selectfont } if } bind def
/Tm { 2 copy 8 2 roll 6 array astore /cairo_font_matrix exch def
      cairo_store_point /cairo_font where { pop cairo_selectfont } if } bind def
/g { setgray } bind def
/rg { setrgbcolor } bind def
/d1 { setcachedevice } bind def
/cairo_data_source {
  CairoDataIndex CairoData length lt
    { CairoData CairoDataIndex get /CairoDataIndex CairoDataIndex 1 add def }
    { () } ifelse
} def
/cairo_flush_ascii85_file { cairo_ascii85_file status { cairo_ascii85_file flushfile } if } def
/cairo_image { image cairo_flush_ascii85_file } def
/cairo_imagemask { imagemask cairo_flush_ascii85_file } def
%%EndProlog
%%BeginSetup
%%EndSetup
%%Page: 1 1
%%BeginPageSetup
%%PageBoundingBox: 0 0 384 384
%%EndPageSetup
q 0 0 384 384 rectclip
1 0 0 -1 0 384 cm q
0.701961 0.388235 0.282353 rg
125.582 258.406 m 121.188 254.012 114.066 254.012 109.672 258.406 c 3.297
 364.781 l -1.098 369.176 -1.098 376.297 3.297 380.691 c 7.691 385.086 14.812
 385.086 19.203 380.691 c 125.582 274.312 l 129.977 269.918 129.977 262.801
 125.582 258.406 c h
125.582 258.406 m f
0.6 0.25098 0.180392 rg
19.203 380.691 m 125.582 274.312 l 129.977 269.918 129.977 262.801 125.582
 258.406 c 3.297 380.691 l 7.691 385.086 14.809 385.086 19.203 380.691 c
 h
19.203 380.691 m f
0.952941 0.960784 0.976471 rg
181.117 202.871 m 170.547 174.043 l 99.48 204.844 l 90.207 232.645 l 91.543
 247.773 97.938 262.582 109.676 274.312 c 128.797 293.418 156.312 298.293
 180.004 289.887 c 202.402 260.91 l h
181.117 202.871 m f
0.882353 0.901961 0.941176 rg
180.004 289.887 m 202.402 260.91 l 181.117 202.871 l 109.672 274.312 l 
128.797 293.418 156.309 298.293 180.004 289.887 c h
180.004 289.887 m f
0.701961 0.388235 0.282353 rg
205.055 178.934 m 201.129 175.012 196.723 171.391 191.633 168.316 c 171.09
 155.891 144.5 155.715 123.867 167.887 c 99.461 182.285 88.02 207.895 90.207
 232.645 c 93.453 230.977 96.539 229.191 99.477 227.348 c 120.895 213.848
 139.551 213.676 154.828 220.535 c 156.758 221.398 158.32 222.785 160.066
 223.922 c 172.113 231.77 180.004 245.441 180.004 260.91 c 180.004 292.484
 l 180.004 304.891 189.984 314.984 202.402 314.984 c 214.816 314.984 224.902
 304.891 224.902 292.484 c 224.902 224.766 l 224.445 208.082 217.746 191.613
 205.055 178.934 c h
205.055 178.934 m f
0.6 0.25098 0.180392 rg
180.004 260.91 m 180.004 292.484 l 180.004 304.891 189.984 314.984 202.402
 314.984 c 214.816 314.984 224.902 304.891 224.902 292.484 c 224.902 224.766
 l 224.445 208.078 217.746 191.613 205.055 178.934 c 160.066 223.922 l 172.113
 231.77 180.004 245.441 180.004 260.91 c h
180.004 260.91 m f
0.952941 0.960784 0.976471 rg
291.5 136.555 m 256.25 127.738 l 201.5 114.055 l 169.516 146.746 l 169.445
 164.129 175.992 181.531 189.215 194.762 c 189.223 194.766 l 215.547 221.086
 258.367 221.082 284.691 194.762 c 297.977 181.473 304.527 164.109 304.457
 146.781 c h
291.5 136.555 m f
0.882353 0.901961 0.941176 rg
284.691 194.762 m 297.977 181.473 304.527 164.109 304.457 146.781 c 291.5
 136.551 l 256.25 127.738 l 189.223 194.766 l 215.547 221.086 258.367 221.082
 284.691 194.762 c h
284.691 194.762 m f
0.701961 0.388235 0.282353 rg
284.691 99.297 m 258.344 72.953 215.52 73.02 189.215 99.297 c 176.137 112.387
 169.59 129.555 169.516 146.746 c 177.801 141.574 186.68 136.555 201.5 136.555
 c 217.32 136.555 226.395 142.246 235.273 147.805 c 235.461 147.922 235.652
 148.031 235.84 148.148 c 244.82 153.809 253.461 159.055 269 159.055 c 284.656
 159.055 292.734 154.059 304.457 146.781 c 304.387 129.57 297.781 112.402
 284.691 99.297 c h
284.691 99.297 m f
0.6 0.25098 0.180392 rg
304.457 146.781 m 304.387 129.57 297.781 112.402 284.691 99.297 c 235.84
 148.148 l 244.82 153.805 253.465 159.055 269.004 159.055 c 284.656 159.055
 292.734 154.059 304.457 146.781 c h
304.457 146.781 m f
0.952941 0.960784 0.976471 rg
371.066 57 m 335.805 48.184 l 281.066 34.5 l 249.016 67.215 l 248.949 84.566
 255.516 101.941 268.781 115.207 c 295.105 141.531 337.91 141.531 364.234
 115.207 c 377.488 101.953 384.062 84.582 384 67.23 c h
371.066 57 m f
0.882353 0.901961 0.941176 rg
364.234 115.207 m 377.484 101.953 384.062 84.582 384 67.23 c 371.066 57
 l 335.805 48.184 l 268.781 115.207 l 295.105 141.531 337.906 141.531 364.234
 115.207 c h
364.234 115.207 m f
0.701961 0.388235 0.282353 rg
364.234 19.754 m 337.91 -6.57 295.105 -6.57 268.781 19.754 c 255.66 32.875
 249.082 50.035 249.016 67.215 c 257.328 62.035 266.203 57 281.062 57 c 
296.906 57 306.004 62.723 314.793 68.25 c 314.988 68.371 315.188 68.484 
315.383 68.605 c 324.398 74.258 333.059 79.5 348.566 79.5 c 363.859 79.5
 371.969 74.762 384 67.23 c 383.938 50.051 377.367 32.891 364.234 19.754
 c h
364.234 19.754 m f
0.6 0.25098 0.180392 rg
384 67.23 m 383.938 50.051 377.367 32.891 364.234 19.754 c 315.383 68.605
 l 324.398 74.258 333.059 79.5 348.566 79.5 c 363.859 79.5 371.969 74.762
 384 67.23 c h
384 67.23 m f
Q Q
showpage
%%Trailer
end
%%EOF
