%!PS-Adobe-3.0 EPSF-3.0
%%Creator: cairo 1.16.0 (https://cairographics.org)
%%CreationDate: Thu Apr  8 07:10:15 2021
%%Pages: 1
%%DocumentData: Clean7Bit
%%LanguageLevel: 2
%%BoundingBox: 0 45 384 339
%%EndComments
%%BeginProlog
50 dict begin
/q { gsave } bind def
/Q { grestore } bind def
/cm { 6 array astore concat } bind def
/w { setlinewidth } bind def
/J { setlinecap } bind def
/j { setlinejoin } bind def
/M { setmiterlimit } bind def
/d { setdash } bind def
/m { moveto } bind def
/l { lineto } bind def
/c { curveto } bind def
/h { closepath } bind def
/re { exch dup neg 3 1 roll 5 3 roll moveto 0 rlineto
      0 exch rlineto 0 rlineto closepath } bind def
/S { stroke } bind def
/f { fill } bind def
/f* { eofill } bind def
/n { newpath } bind def
/W { clip } bind def
/W* { eoclip } bind def
/BT { } bind def
/ET { } bind def
/BDC { mark 3 1 roll /BDC pdfmark } bind def
/EMC { mark /EMC pdfmark } bind def
/cairo_store_point { /cairo_point_y exch def /cairo_point_x exch def } def
/Tj { show currentpoint cairo_store_point } bind def
/TJ {
  {
    dup
    type /stringtype eq
    { show } { -0.001 mul 0 cairo_font_matrix dtransform rmoveto } ifelse
  } forall
  currentpoint cairo_store_point
} bind def
/cairo_selectfont { cairo_font_matrix aload pop pop pop 0 0 6 array astore
    cairo_font exch selectfont cairo_point_x cairo_point_y moveto } bind def
/Tf { pop /cairo_font exch def /cairo_font_matrix where
      { pop cairo_selectfont } if } bind def
/Td { matrix translate cairo_font_matrix matrix concatmatrix dup
      /cairo_font_matrix exch def dup 4 get exch 5 get cairo_store_point
      /cairo_font where { pop cairo_selectfont } if } bind def
/Tm { 2 copy 8 2 roll 6 array astore /cairo_font_matrix exch def
      cairo_store_point /cairo_font where { pop cairo_selectfont } if } bind def
/g { setgray } bind def
/rg { setrgbcolor } bind def
/d1 { setcachedevice } bind def
/cairo_data_source {
  CairoDataIndex CairoData length lt
    { CairoData CairoDataIndex get /CairoDataIndex CairoDataIndex 1 add def }
    { () } ifelse
} def
/cairo_flush_ascii85_file { cairo_ascii85_file status { cairo_ascii85_file flushfile } if } def
/cairo_image { image cairo_flush_ascii85_file } def
/cairo_imagemask { imagemask cairo_flush_ascii85_file } def
%%EndProlog
%%BeginSetup
%%EndSetup
%%Page: 1 1
%%BeginPageSetup
%%PageBoundingBox: 0 45 384 339
%%EndPageSetup
q 0 45 384 294 rectclip
1 0 0 -1 0 384 cm q
0.901961 0.580392 0.360784 rg
347.699 104.25 m 342.074 102.898 327 99.523 309 85.352 c 285.824 67.348
 237.676 45.75 192 45.75 c 146.324 45.75 97.426 67.348 74.25 85.352 c 56.477
 99.301 41.402 102.898 33.977 104.699 c 13.012 110.004 0 129.203 0 147 c
 0 158.25 l 0 164.465 5.035 169.5 11.25 169.5 c 56.25 169.5 l 78.395 180.75
 l 309 180.75 l 327 169.5 l 372.75 169.5 l 378.965 169.5 384 164.465 384
 158.25 c 384 147 l 384 128.348 369.734 109.695 347.699 104.25 c h
347.699 104.25 m f
372.75 214.5 m 327 214.5 l 310.777 203.25 l 79.105 203.25 l 56.25 214.5
 l 11.25 214.5 l 5.035 214.5 0 219.535 0 225.75 c 0 237 l 0 254.797 13.012
 273.996 33.977 279.301 c 41.402 281.102 56.477 284.699 74.25 298.648 c 
97.426 316.652 146.324 338.25 192 338.25 c 237.676 338.25 285.824 316.652
 309 298.648 c 327 284.477 342.074 281.102 347.699 279.75 c 369.734 274.305
 384 255.652 384 237 c 384 225.75 l 384 219.535 378.965 214.5 372.75 214.5
 c h
372.75 214.5 m f
0.8 0.427451 0.239216 rg
327 169.5 m 372.75 169.5 l 378.965 169.5 384 164.465 384 158.25 c 384 147
 l 384 128.348 369.734 109.695 347.699 104.25 c 342.074 102.898 327 99.523
 309 85.352 c 285.824 67.348 237.676 45.75 192 45.75 c 192 180.75 l 309 
180.75 l h
327 169.5 m f
347.699 279.75 m 369.734 274.305 384 255.652 384 237 c 384 225.75 l 384
 219.535 378.965 214.5 372.75 214.5 c 327 214.5 l 310.777 203.25 l 192 203.25
 l 192 338.25 l 237.676 338.25 285.824 316.652 309 298.648 c 327 284.477
 342.074 281.102 347.699 279.75 c h
347.699 279.75 m f
0.701961 0.388235 0.282353 rg
327 169.5 m 298.262 169.5 l 276.684 169.5 256.051 165.305 236.977 157.02
 c 221.707 150.371 206.855 147.051 192 147.051 c 177.145 147.051 162.293
 150.371 147.023 157.02 c 127.949 165.305 106.566 169.5 84.988 169.5 c 56.25
 169.5 l 43.836 169.5 33.75 179.598 33.75 192 c 33.75 204.402 43.836 214.5
 56.25 214.5 c 84.988 214.5 l 106.566 214.5 127.949 218.695 147.023 226.98
 c 162.293 233.629 177.145 236.953 192 236.949 c 206.852 236.949 221.707
 233.625 237 226.98 c 244.117 223.871 251.699 221.277 259.5 219.289 c 259.5
 315.75 l 259.5 328.152 269.586 338.25 282 338.25 c 294.414 338.25 304.5
 328.152 304.5 315.75 c 304.5 214.5 l 327 214.5 l 339.414 214.5 349.5 204.402
 349.5 192 c 349.5 179.598 339.414 169.5 327 169.5 c h
327 169.5 m f
0.6 0.25098 0.180392 rg
259.5 219.289 m 259.5 315.75 l 259.5 328.152 269.586 338.25 282 338.25 
c 294.414 338.25 304.5 328.152 304.5 315.75 c 304.5 214.5 l 327 214.5 l 
339.414 214.5 349.5 204.402 349.5 192 c 349.5 179.598 339.414 169.5 327 
169.5 c 298.262 169.5 l 276.684 169.5 256.051 165.305 236.977 157.02 c 221.707
 150.371 206.855 147.051 192 147.051 c 192 236.949 l 206.852 236.949 221.707
 233.625 237 226.98 c 244.117 223.871 251.699 221.277 259.5 219.289 c h
259.5 219.289 m f
Q Q
showpage
%%Trailer
end
%%EOF
