%!PS-Adobe-3.0 EPSF-3.0
%%Creator: cairo 1.16.0 (https://cairographics.org)
%%CreationDate: Thu Apr  8 07:10:16 2021
%%Pages: 1
%%DocumentData: Clean7Bit
%%LanguageLevel: 2
%%BoundingBox: 0 34 384 350
%%EndComments
%%BeginProlog
50 dict begin
/q { gsave } bind def
/Q { grestore } bind def
/cm { 6 array astore concat } bind def
/w { setlinewidth } bind def
/J { setlinecap } bind def
/j { setlinejoin } bind def
/M { setmiterlimit } bind def
/d { setdash } bind def
/m { moveto } bind def
/l { lineto } bind def
/c { curveto } bind def
/h { closepath } bind def
/re { exch dup neg 3 1 roll 5 3 roll moveto 0 rlineto
      0 exch rlineto 0 rlineto closepath } bind def
/S { stroke } bind def
/f { fill } bind def
/f* { eofill } bind def
/n { newpath } bind def
/W { clip } bind def
/W* { eoclip } bind def
/BT { } bind def
/ET { } bind def
/BDC { mark 3 1 roll /BDC pdfmark } bind def
/EMC { mark /EMC pdfmark } bind def
/cairo_store_point { /cairo_point_y exch def /cairo_point_x exch def } def
/Tj { show currentpoint cairo_store_point } bind def
/TJ {
  {
    dup
    type /stringtype eq
    { show } { -0.001 mul 0 cairo_font_matrix dtransform rmoveto } ifelse
  } forall
  currentpoint cairo_store_point
} bind def
/cairo_selectfont { cairo_font_matrix aload pop pop pop 0 0 6 array astore
    cairo_font exch selectfont cairo_point_x cairo_point_y moveto } bind def
/Tf { pop /cairo_font exch def /cairo_font_matrix where
      { pop cairo_selectfont } if } bind def
/Td { matrix translate cairo_font_matrix matrix concatmatrix dup
      /cairo_font_matrix exch def dup 4 get exch 5 get cairo_store_point
      /cairo_font where { pop cairo_selectfont } if } bind def
/Tm { 2 copy 8 2 roll 6 array astore /cairo_font_matrix exch def
      cairo_store_point /cairo_font where { pop cairo_selectfont } if } bind def
/g { setgray } bind def
/rg { setrgbcolor } bind def
/d1 { setcachedevice } bind def
/cairo_data_source {
  CairoDataIndex CairoData length lt
    { CairoData CairoDataIndex get /CairoDataIndex CairoDataIndex 1 add def }
    { () } ifelse
} def
/cairo_flush_ascii85_file { cairo_ascii85_file status { cairo_ascii85_file flushfile } if } def
/cairo_image { image cairo_flush_ascii85_file } def
/cairo_imagemask { imagemask cairo_flush_ascii85_file } def
%%EndProlog
%%BeginSetup
%%EndSetup
%%Page: 1 1
%%BeginPageSetup
%%PageBoundingBox: 0 34 384 350
%%EndPageSetup
q 0 34 384 316 rectclip
1 0 0 -1 0 384 cm q
1 0.752941 0.501961 rg
327.703 34.5 m 260.293 34.5 l 221.02 34.5 193.879 73.855 207.535 110.297
 c 248.996 225.75 l 273.332 237 l 316.496 237 l 338.996 225.75 l 380.371
 110.492 l 394.156 73.789 366.961 34.5 327.703 34.5 c h
327.703 34.5 m f
0.901961 0.580392 0.360784 rg
338.996 225.75 m 380.371 110.492 l 394.156 73.789 366.961 34.5 327.703 
34.5 c 293.996 34.5 l 293.996 237 l 316.496 237 l h
338.996 225.75 m f
0.596078 0.85098 0.341176 rg
221.246 270.344 m 150.559 166.832 l 142.164 154.414 128.234 147 113.25 
147 c 98.266 147 83.582 154.418 75.191 166.832 c 4.977 270.75 l 221.387 
270.75 l 221.309 270.625 221.332 270.465 221.246 270.344 c h
221.246 270.344 m f
0.4 0.74902 0.223529 rg
221.246 270.344 m 150.559 166.832 l 142.164 154.414 128.234 147 113.25 
147 c 113.25 270.75 l 221.387 270.75 l 221.309 270.625 221.332 270.465 221.246
 270.344 c h
221.246 270.344 m f
0.952941 0.960784 0.976471 rg
215.246 259.5 m 11.25 259.5 l 5.035 259.5 0 264.535 0 270.75 c 0 282 l 
0 319.277 30.219 349.5 67.5 349.5 c 158.25 349.5 l 195.527 349.5 226.496
 319.277 226.496 282 c 226.496 270.75 l 226.496 264.535 221.461 259.5 215.246
 259.5 c h
215.246 259.5 m f
0.882353 0.901961 0.941176 rg
226.496 282 m 226.496 270.75 l 226.496 264.535 221.461 259.5 215.246 259.5
 c 113.25 259.5 l 113.25 349.5 l 158.25 349.5 l 195.527 349.5 226.496 319.277
 226.496 282 c h
226.496 282 m f
1 0.882353 0.298039 rg
293.996 225.75 m 248.996 225.75 l 248.996 338.25 l 248.996 344.469 254.027
 349.5 260.246 349.5 c 327.746 349.5 l 333.965 349.5 338.996 344.469 338.996
 338.25 c 338.996 225.75 l h
293.996 225.75 m f
1 0.74902 0.25098 rg
338.996 338.25 m 338.996 225.75 l 293.996 225.75 l 293.996 349.5 l 327.746
 349.5 l 333.965 349.5 338.996 344.469 338.996 338.25 c h
338.996 338.25 m f
0.901961 0.580392 0.360784 rg
293.996 34.5 m 269.191 34.5 248.996 54.684 248.996 79.5 c 248.996 89.707
 252.777 115.195 258.906 138.598 c 260.469 144.605 266.598 148.133 272.617
 146.637 c 278.637 145.066 282.242 138.914 280.66 132.906 c 274.77 110.316
 271.496 86.992 271.496 79.5 c 271.496 67.098 281.582 57 293.996 57 c 306.41
 57 316.496 67.098 316.496 79.5 c 316.496 86.992 313.223 110.316 307.336
 132.906 c 305.754 138.914 309.355 145.066 315.375 146.637 c 321.516 148.207
 327.547 144.504 329.086 138.598 c 335.219 115.195 338.996 89.707 338.996
 79.5 c 338.996 54.684 318.805 34.5 293.996 34.5 c h
293.996 34.5 m f
0.8 0.427451 0.239216 rg
316.496 79.5 m 316.496 86.992 313.223 110.316 307.336 132.906 c 305.754
 138.914 309.355 145.066 315.375 146.637 c 321.516 148.207 327.547 144.504
 329.086 138.598 c 335.219 115.195 338.996 89.707 338.996 79.5 c 338.996
 54.684 318.805 34.5 293.996 34.5 c 293.996 57 l 306.41 57 316.496 67.098
 316.496 79.5 c h
316.496 79.5 m f
Q Q
showpage
%%Trailer
end
%%EOF
