%!PS-Adobe-3.0 EPSF-3.0
%%Creator: cairo 1.16.0 (https://cairographics.org)
%%CreationDate: Thu Apr  8 07:10:19 2021
%%Pages: 1
%%DocumentData: Clean7Bit
%%LanguageLevel: 2
%%BoundingBox: 0 0 384 384
%%EndComments
%%BeginProlog
50 dict begin
/q { gsave } bind def
/Q { grestore } bind def
/cm { 6 array astore concat } bind def
/w { setlinewidth } bind def
/J { setlinecap } bind def
/j { setlinejoin } bind def
/M { setmiterlimit } bind def
/d { setdash } bind def
/m { moveto } bind def
/l { lineto } bind def
/c { curveto } bind def
/h { closepath } bind def
/re { exch dup neg 3 1 roll 5 3 roll moveto 0 rlineto
      0 exch rlineto 0 rlineto closepath } bind def
/S { stroke } bind def
/f { fill } bind def
/f* { eofill } bind def
/n { newpath } bind def
/W { clip } bind def
/W* { eoclip } bind def
/BT { } bind def
/ET { } bind def
/BDC { mark 3 1 roll /BDC pdfmark } bind def
/EMC { mark /EMC pdfmark } bind def
/cairo_store_point { /cairo_point_y exch def /cairo_point_x exch def } def
/Tj { show currentpoint cairo_store_point } bind def
/TJ {
  {
    dup
    type /stringtype eq
    { show } { -0.001 mul 0 cairo_font_matrix dtransform rmoveto } ifelse
  } forall
  currentpoint cairo_store_point
} bind def
/cairo_selectfont { cairo_font_matrix aload pop pop pop 0 0 6 array astore
    cairo_font exch selectfont cairo_point_x cairo_point_y moveto } bind def
/Tf { pop /cairo_font exch def /cairo_font_matrix where
      { pop cairo_selectfont } if } bind def
/Td { matrix translate cairo_font_matrix matrix concatmatrix dup
      /cairo_font_matrix exch def dup 4 get exch 5 get cairo_store_point
      /cairo_font where { pop cairo_selectfont } if } bind def
/Tm { 2 copy 8 2 roll 6 array astore /cairo_font_matrix exch def
      cairo_store_point /cairo_font where { pop cairo_selectfont } if } bind def
/g { setgray } bind def
/rg { setrgbcolor } bind def
/d1 { setcachedevice } bind def
/cairo_data_source {
  CairoDataIndex CairoData length lt
    { CairoData CairoDataIndex get /CairoDataIndex CairoDataIndex 1 add def }
    { () } ifelse
} def
/cairo_flush_ascii85_file { cairo_ascii85_file status { cairo_ascii85_file flushfile } if } def
/cairo_image { image cairo_flush_ascii85_file } def
/cairo_imagemask { imagemask cairo_flush_ascii85_file } def
%%EndProlog
%%BeginSetup
%%EndSetup
%%Page: 1 1
%%BeginPageSetup
%%PageBoundingBox: 0 0 384 384
%%EndPageSetup
q 0 0 384 384 rectclip
1 0 0 -1 0 384 cm q
1 0.85098 0.701961 rg
384 192 m 384 178.004 376.066 164.73 361.652 154.625 c 356.887 151.262 
355.262 145.211 357.723 139.914 c 365.148 123.949 365.367 108.48 358.379
 96.387 c 351.395 84.27 337.129 76.73 319.594 75.172 c 313.773 74.656 309.332
 70.227 308.828 64.395 c 307.27 46.859 299.73 32.609 287.625 25.621 c 275.496
 18.621 260.027 18.863 244.098 26.27 c 238.867 28.73 232.738 27.125 229.375
 22.336 c 219.27 7.934 205.633 0 192 0 c 178.367 0 164.73 7.934 154.625 
22.336 c 151.242 27.125 145.152 28.73 139.902 26.27 c 123.949 18.863 108.48
 18.621 96.375 25.621 c 84.27 32.605 76.73 46.859 75.172 64.414 c 74.668
 70.227 70.227 74.656 64.406 75.172 c 46.871 76.73 32.609 84.27 25.641 96.363
 c 18.633 108.48 18.852 123.949 26.281 139.914 c 28.742 145.211 27.113 151.262
 22.348 154.625 c 7.934 164.73 0 178.004 0 192 c 0 205.996 7.934 219.27 
22.348 229.375 c 27.113 232.738 28.738 238.789 26.277 244.086 c 18.852 260.051
 18.633 275.52 25.621 287.613 c 32.605 299.73 46.871 307.27 64.406 308.828
 c 70.227 309.344 74.668 313.773 75.172 319.605 c 76.73 337.141 84.27 351.391
 96.375 358.379 c 108.48 365.355 123.949 365.125 139.902 357.719 c 145.219
 355.27 151.238 356.875 154.625 361.664 c 164.73 376.066 178.004 384 192
 384 c 205.996 384 219.27 376.066 229.375 361.664 c 232.738 356.875 238.867
 355.27 244.098 357.73 c 260.027 365.113 275.496 365.355 287.625 358.379
 c 299.73 351.395 307.27 337.141 308.828 319.586 c 309.332 313.773 313.773
 309.344 319.594 308.828 c 337.129 307.27 351.391 299.73 358.359 287.637
 c 365.367 275.52 365.148 260.051 357.719 244.086 c 355.258 238.789 356.887
 232.738 361.652 229.375 c 376.066 219.27 384 205.996 384 192 c h
384 192 m f
1 0.733333 0.6 rg
229.375 361.664 m 232.738 356.875 238.867 355.27 244.098 357.73 c 260.027
 365.113 275.496 365.355 287.625 358.379 c 299.73 351.395 307.27 337.141
 308.828 319.586 c 309.332 313.773 313.773 309.344 319.594 308.828 c 337.129
 307.27 351.391 299.73 358.359 287.637 c 365.367 275.52 365.148 260.051 
357.719 244.086 c 355.258 238.789 356.887 232.738 361.652 229.375 c 376.066
 219.27 384 205.996 384 192 c 384 178.004 376.066 164.73 361.652 154.625
 c 356.887 151.262 355.262 145.211 357.723 139.914 c 365.148 123.949 365.367
 108.48 358.379 96.387 c 351.395 84.27 337.129 76.73 319.594 75.172 c 313.773
 74.656 309.332 70.227 308.828 64.395 c 307.27 46.859 299.73 32.609 287.625
 25.621 c 275.496 18.621 260.027 18.863 244.098 26.27 c 238.867 28.73 232.738
 27.125 229.375 22.336 c 219.27 7.934 205.633 0 192 0 c 192 384 l 205.996
 384 219.27 376.066 229.375 361.664 c h
229.375 361.664 m f
1 0.454902 0.34902 rg
192 91.887 m 188.246 91.508 184.602 90.75 180.75 90.75 c 118.723 90.75 
68.25 141.223 68.25 203.25 c 68.25 209.469 73.281 214.5 79.5 214.5 c 85.719
 214.5 90.75 209.469 90.75 203.25 c 90.75 153.625 131.113 113.25 180.75 
113.25 c 184.602 113.25 188.273 113.914 192 114.387 c 236.281 119.996 270.75
 157.477 270.75 203.25 c 270.75 240.473 240.473 270.75 203.25 270.75 c 199.398
 270.75 195.68 270.234 192 269.613 c 160.141 264.219 135.75 236.621 135.75
 203.25 c 135.75 178.434 155.941 158.25 180.75 158.25 c 184.656 158.25 188.383
 158.906 192 159.848 c 211.352 164.879 225.75 182.34 225.75 203.25 c 225.75
 215.652 215.664 225.75 203.25 225.75 c 199.062 225.75 195.359 224.293 192
 222.293 c 185.398 218.367 180.75 211.469 180.75 203.25 c 180.75 197.031
 175.719 192 169.5 192 c 163.281 192 158.25 197.031 158.25 203.25 c 158.25
 224.16 172.648 241.621 192 246.652 c 195.617 247.594 199.344 248.25 203.25
 248.25 c 228.059 248.25 248.25 228.066 248.25 203.25 c 248.25 169.879 223.859
 142.281 192 136.887 c 188.32 136.266 184.602 135.75 180.75 135.75 c 143.527
 135.75 113.25 166.027 113.25 203.25 c 113.25 249.023 147.719 286.504 192
 292.113 c 195.727 292.586 199.398 293.25 203.25 293.25 c 252.887 293.25
 293.25 252.875 293.25 203.25 c 293.25 145.074 248.691 97.625 192 91.887
 c h
192 91.887 m f
0.94902 0.294118 0.235294 rg
293.25 203.25 m 293.25 145.074 248.691 97.625 192 91.887 c 192 114.387 
l 236.281 119.996 270.75 157.477 270.75 203.25 c 270.75 240.473 240.473 
270.75 203.25 270.75 c 199.398 270.75 195.68 270.234 192 269.613 c 192 292.113
 l 195.727 292.586 199.398 293.25 203.25 293.25 c 252.887 293.25 293.25 
252.875 293.25 203.25 c h
293.25 203.25 m f
225.75 203.25 m 225.75 215.652 215.664 225.75 203.25 225.75 c 199.062 225.75
 195.359 224.293 192 222.293 c 192 246.652 l 195.617 247.59 199.344 248.25
 203.25 248.25 c 228.059 248.25 248.25 228.066 248.25 203.25 c 248.25 169.879
 223.859 142.281 192 136.887 c 192 159.848 l 211.352 164.879 225.75 182.34
 225.75 203.25 c h
225.75 203.25 m f
Q Q
showpage
%%Trailer
end
%%EOF
