%!PS-Adobe-3.0 EPSF-3.0
%%Creator: cairo 1.16.0 (https://cairographics.org)
%%CreationDate: Thu Apr  8 07:10:14 2021
%%Pages: 1
%%DocumentData: Clean7Bit
%%LanguageLevel: 2
%%BoundingBox: 0 0 384 384
%%EndComments
%%BeginProlog
50 dict begin
/q { gsave } bind def
/Q { grestore } bind def
/cm { 6 array astore concat } bind def
/w { setlinewidth } bind def
/J { setlinecap } bind def
/j { setlinejoin } bind def
/M { setmiterlimit } bind def
/d { setdash } bind def
/m { moveto } bind def
/l { lineto } bind def
/c { curveto } bind def
/h { closepath } bind def
/re { exch dup neg 3 1 roll 5 3 roll moveto 0 rlineto
      0 exch rlineto 0 rlineto closepath } bind def
/S { stroke } bind def
/f { fill } bind def
/f* { eofill } bind def
/n { newpath } bind def
/W { clip } bind def
/W* { eoclip } bind def
/BT { } bind def
/ET { } bind def
/BDC { mark 3 1 roll /BDC pdfmark } bind def
/EMC { mark /EMC pdfmark } bind def
/cairo_store_point { /cairo_point_y exch def /cairo_point_x exch def } def
/Tj { show currentpoint cairo_store_point } bind def
/TJ {
  {
    dup
    type /stringtype eq
    { show } { -0.001 mul 0 cairo_font_matrix dtransform rmoveto } ifelse
  } forall
  currentpoint cairo_store_point
} bind def
/cairo_selectfont { cairo_font_matrix aload pop pop pop 0 0 6 array astore
    cairo_font exch selectfont cairo_point_x cairo_point_y moveto } bind def
/Tf { pop /cairo_font exch def /cairo_font_matrix where
      { pop cairo_selectfont } if } bind def
/Td { matrix translate cairo_font_matrix matrix concatmatrix dup
      /cairo_font_matrix exch def dup 4 get exch 5 get cairo_store_point
      /cairo_font where { pop cairo_selectfont } if } bind def
/Tm { 2 copy 8 2 roll 6 array astore /cairo_font_matrix exch def
      cairo_store_point /cairo_font where { pop cairo_selectfont } if } bind def
/g { setgray } bind def
/rg { setrgbcolor } bind def
/d1 { setcachedevice } bind def
/cairo_data_source {
  CairoDataIndex CairoData length lt
    { CairoData CairoDataIndex get /CairoDataIndex CairoDataIndex 1 add def }
    { () } ifelse
} def
/cairo_flush_ascii85_file { cairo_ascii85_file status { cairo_ascii85_file flushfile } if } def
/cairo_image { image cairo_flush_ascii85_file } def
/cairo_imagemask { imagemask cairo_flush_ascii85_file } def
%%EndProlog
%%BeginSetup
%%EndSetup
%%Page: 1 1
%%BeginPageSetup
%%PageBoundingBox: 0 0 384 384
%%EndPageSetup
q 0 0 384 384 rectclip
1 0 0 -1 0 384 cm q
1 0.454902 0.34902 rg
356.262 43.629 m 340.16 44.191 l 340.156 44.191 l 340.348 27.727 l 312.926
 5.559 280.43 0.375 278.918 0.156 c 273.094 -0.832 267.777 2.957 266.371
 8.562 c 240.109 109.105 l 274.914 143.91 l 375.465 117.656 l 381.066 116.262
 384.715 110.836 383.879 105.121 c 383.641 103.609 378.469 71.055 356.262
 43.629 c h
356.262 43.629 m f
0.94902 0.294118 0.235294 rg
375.465 117.656 m 381.07 116.262 384.715 110.832 383.883 105.121 c 383.641
 103.609 378.469 71.055 356.262 43.629 c 340.16 44.191 l 257.68 126.672 
l 274.914 143.91 l h
375.465 117.656 m f
1 0.882353 0.298039 rg
275.844 188.059 m 275.887 187.992 275.953 187.938 276.02 187.871 c 286.656
 177.262 292.5 163.133 292.5 148.102 c 292.5 133.074 286.656 118.945 276.02
 108.332 c 254.09 86.414 218.387 86.371 196.457 108.332 c 196.391 108.387
 196.348 108.441 196.281 108.496 c 178.969 106.09 161.215 111.77 148.734
 124.242 c 148.668 124.297 148.625 124.352 148.559 124.406 c 131.242 122
 113.469 127.68 101.008 140.148 c 95.605 145.555 91.363 152.156 88.551 159.496
 c 81.168 162.297 74.688 166.484 69.191 171.965 c 61.676 179.469 56.535 
188.906 54.23 199.234 c 44.871 200.66 36.168 204.977 29.422 211.746 c 17.82
 223.336 13.367 240.199 17.652 255.559 c 16.07 256.758 14.574 258.066 13.168
 259.473 c -3.137 275.762 -4.301 301.535 9.676 319.191 c 5.41 334.594 9.934
 351.371 21.469 362.883 c 32.957 374.422 49.77 378.641 65.172 374.332 c 
82.832 388.32 108.621 387.105 124.871 370.84 c 126.277 369.434 127.594 367.938
 128.781 366.355 c 144.164 370.641 160.992 366.543 172.594 354.941 c 179.363
 348.184 183.691 339.484 185.117 330.125 c 195.426 327.805 204.871 322.676
 212.363 315.172 c 217.836 309.688 222.035 303.195 224.848 295.812 c 232.207
 293.012 238.711 288.824 244.203 283.332 c 256.664 270.863 262.375 253.176
 259.938 235.781 c 260.004 235.727 260.047 235.664 260.113 235.609 c 272.57
 223.129 278.285 205.449 275.844 188.059 c h
275.844 188.059 m f
1 0.74902 0.25098 rg
65.172 374.332 m 82.836 388.32 108.625 387.105 124.871 370.84 c 126.277
 369.434 127.598 367.938 128.781 366.355 c 144.164 370.641 160.992 366.543
 172.594 354.941 c 179.363 348.184 183.691 339.484 185.121 330.125 c 195.426
 327.805 204.875 322.676 212.367 315.172 c 217.836 309.688 222.035 303.195
 224.848 295.812 c 232.207 293.012 238.711 288.824 244.203 283.332 c 256.664
 270.863 262.375 253.176 259.938 235.781 c 260.004 235.727 260.047 235.664
 260.113 235.609 c 272.57 223.125 278.285 205.449 275.848 188.059 c 275.891
 187.992 275.957 187.938 276.02 187.871 c 286.656 177.262 292.5 163.133 
292.5 148.102 c 292.5 133.074 286.656 118.945 276.02 108.332 c 21.469 362.883
 l 32.957 374.422 49.77 378.641 65.172 374.332 c h
65.172 374.332 m f
1 0.6 0.2 rg
180 282.75 m 180 288.965 174.961 294 168.75 294 c 162.535 294 157.5 288.965
 157.5 282.75 c 157.5 276.535 162.535 271.5 168.75 271.5 c 174.961 271.5
 180 276.535 180 282.75 c h
180 282.75 m f
0.94902 0.294118 0.235294 rg
349.027 35.32 m 348.973 35.266 348.934 35.203 348.879 35.148 c 346.141 
32.414 343.242 30.062 340.348 27.723 c 295.109 73.27 l 290.715 77.688 290.762
 84.809 295.156 89.191 c 299.559 93.543 306.664 93.559 311.062 89.137 c 
356.262 43.629 l 353.984 40.812 351.684 37.996 349.027 35.32 c h
349.027 35.32 m f
0.8 0.160784 0.266667 rg
311.062 89.137 m 356.262 43.629 l 353.984 40.812 351.684 37.996 349.027
 35.324 c 295.16 89.191 l 299.559 93.543 306.664 93.559 311.062 89.137 c
 h
311.062 89.137 m f
1 0.74902 0.25098 rg
244.348 140.004 m 242.301 137.863 239.445 136.5 236.25 136.5 c 230.035 
136.5 225 141.535 225 147.75 c 225 150.949 226.363 153.797 228.504 155.848
 c 230.527 157.777 233.234 159 236.25 159 c 242.461 159 247.5 153.965 247.5
 147.75 c 247.5 144.734 246.277 142.027 244.348 140.004 c h
244.348 140.004 m f
1 0.6 0.2 rg
247.5 147.75 m 247.5 144.734 246.277 142.023 244.348 140.004 c 228.504 
155.848 l 230.527 157.777 233.234 159 236.25 159 c 242.461 159 247.5 153.965
 247.5 147.75 c h
247.5 147.75 m f
1 0.74902 0.25098 rg
102.613 281.387 m 89.473 268.227 68.027 268.227 54.887 281.387 c 50.492
 285.781 50.492 292.902 54.887 297.297 c 59.281 301.691 66.402 301.691 70.797
 297.297 c 75.191 292.902 82.309 292.902 86.703 297.297 c 86.766 297.359
 86.781 297.445 86.844 297.508 c 91.055 301.906 91.035 308.883 86.703 313.203
 c 82.309 317.598 82.309 324.719 86.703 329.113 c 91.098 333.508 98.219 
333.508 102.613 329.113 c 115.711 316.012 115.727 294.777 102.754 281.602
 c 102.691 281.535 102.676 281.449 102.613 281.387 c h
102.613 281.387 m f
147.613 213.887 m 134.473 200.727 113.027 200.727 99.887 213.887 c 95.492
 218.281 95.492 225.402 99.887 229.797 c 104.281 234.191 111.402 234.191
 115.797 229.797 c 120.191 225.402 127.309 225.402 131.703 229.797 c 136.098
 234.18 136.098 241.32 131.703 245.703 c 129.012 248.398 128.172 252.086
 128.781 255.57 c 129.164 257.773 130.004 259.91 131.703 261.613 c 136.098
 266.008 143.219 266.008 147.613 261.613 c 156.555 252.672 158.918 240.02
 155.711 228.641 c 154.199 223.266 151.832 218.109 147.613 213.887 c h
147.613 213.887 m f
215.25 169.102 m 215.191 169.035 215.176 168.949 215.113 168.887 c 201.973
 155.727 180.527 155.727 167.387 168.887 c 162.992 173.281 162.992 180.402
 167.387 184.797 c 171.781 189.191 178.902 189.191 183.297 184.797 c 187.688
 180.402 194.809 180.402 199.203 184.797 c 199.266 184.859 199.281 184.945
 199.344 185.008 c 203.551 189.406 203.535 196.383 199.203 200.703 c 194.809
 205.098 194.809 212.219 199.203 216.613 c 203.598 221.008 210.719 221.008
 215.113 216.613 c 228.211 203.512 228.227 182.277 215.25 169.102 c h
215.25 169.102 m f
1 0.6 0.2 rg
86.703 313.203 m 82.309 317.598 82.309 324.719 86.703 329.113 c 91.098 
333.508 98.219 333.508 102.613 329.113 c 115.711 316.012 115.73 294.777 
102.754 281.602 c 86.844 297.508 l 91.055 301.906 91.035 308.883 86.703 
313.203 c h
86.703 313.203 m f
147.613 261.613 m 156.555 252.672 158.918 240.02 155.711 228.641 c 128.777
 255.574 l 129.164 257.773 130 259.91 131.703 261.613 c 136.098 266.008 
143.219 266.008 147.613 261.613 c h
147.613 261.613 m f
199.203 200.703 m 194.809 205.098 194.809 212.219 199.203 216.613 c 203.598
 221.008 210.719 221.008 215.113 216.613 c 228.211 203.512 228.227 182.277
 215.254 169.102 c 199.344 185.008 l 203.551 189.406 203.535 196.383 199.203
 200.703 c h
199.203 200.703 m f
Q Q
showpage
%%Trailer
end
%%EOF
