%!PS-Adobe-3.0 EPSF-3.0
%%Creator: cairo 1.16.0 (https://cairographics.org)
%%CreationDate: Thu Apr  8 07:10:18 2021
%%Pages: 1
%%DocumentData: Clean7Bit
%%LanguageLevel: 2
%%BoundingBox: 0 0 384 384
%%EndComments
%%BeginProlog
50 dict begin
/q { gsave } bind def
/Q { grestore } bind def
/cm { 6 array astore concat } bind def
/w { setlinewidth } bind def
/J { setlinecap } bind def
/j { setlinejoin } bind def
/M { setmiterlimit } bind def
/d { setdash } bind def
/m { moveto } bind def
/l { lineto } bind def
/c { curveto } bind def
/h { closepath } bind def
/re { exch dup neg 3 1 roll 5 3 roll moveto 0 rlineto
      0 exch rlineto 0 rlineto closepath } bind def
/S { stroke } bind def
/f { fill } bind def
/f* { eofill } bind def
/n { newpath } bind def
/W { clip } bind def
/W* { eoclip } bind def
/BT { } bind def
/ET { } bind def
/BDC { mark 3 1 roll /BDC pdfmark } bind def
/EMC { mark /EMC pdfmark } bind def
/cairo_store_point { /cairo_point_y exch def /cairo_point_x exch def } def
/Tj { show currentpoint cairo_store_point } bind def
/TJ {
  {
    dup
    type /stringtype eq
    { show } { -0.001 mul 0 cairo_font_matrix dtransform rmoveto } ifelse
  } forall
  currentpoint cairo_store_point
} bind def
/cairo_selectfont { cairo_font_matrix aload pop pop pop 0 0 6 array astore
    cairo_font exch selectfont cairo_point_x cairo_point_y moveto } bind def
/Tf { pop /cairo_font exch def /cairo_font_matrix where
      { pop cairo_selectfont } if } bind def
/Td { matrix translate cairo_font_matrix matrix concatmatrix dup
      /cairo_font_matrix exch def dup 4 get exch 5 get cairo_store_point
      /cairo_font where { pop cairo_selectfont } if } bind def
/Tm { 2 copy 8 2 roll 6 array astore /cairo_font_matrix exch def
      cairo_store_point /cairo_font where { pop cairo_selectfont } if } bind def
/g { setgray } bind def
/rg { setrgbcolor } bind def
/d1 { setcachedevice } bind def
/cairo_data_source {
  CairoDataIndex CairoData length lt
    { CairoData CairoDataIndex get /CairoDataIndex CairoDataIndex 1 add def }
    { () } ifelse
} def
/cairo_flush_ascii85_file { cairo_ascii85_file status { cairo_ascii85_file flushfile } if } def
/cairo_image { image cairo_flush_ascii85_file } def
/cairo_imagemask { imagemask cairo_flush_ascii85_file } def
%%EndProlog
%%BeginSetup
%%EndSetup
%%Page: 1 1
%%BeginPageSetup
%%PageBoundingBox: 0 0 384 384
%%EndPageSetup
q 0 0 384 384 rectclip
1 0 0 -1 0 384 cm q
0.901961 0.580392 0.360784 rg
166.215 217.801 m 161.824 213.406 154.703 213.406 150.309 217.801 c 3.316
 364.797 l -1.078 369.191 -1.078 376.309 3.316 380.703 c 7.707 385.098 14.828
 385.098 19.223 380.703 c 166.215 233.711 l 170.613 229.316 170.613 222.195
 166.215 217.801 c h
166.215 217.801 m f
0.8 0.427451 0.239216 rg
19.223 380.703 m 166.215 233.711 l 170.609 229.316 170.609 222.195 166.215
 217.801 c 3.316 380.703 l 7.711 385.098 14.828 385.098 19.223 380.703 c
 h
19.223 380.703 m f
0.8 0.160784 0.266667 rg
376.199 45.406 m 225.52 236.555 l 331.93 239.148 l 356.664 239.836 378.375
 219.781 378.047 193.547 c h
376.199 45.406 m f
0.94902 0.294118 0.235294 rg
190.473 5.984 m 163.027 6.203 144.277 28.012 144.883 52.082 c 146.926 136.035
 l 338.605 7.832 l h
190.473 5.984 m f
1 0.454902 0.34902 rg
376.262 7.754 m 346.305 -22.203 214.617 42.039 182.059 74.613 c 140.75 
115.898 114.781 187.195 107.793 208.059 c 106.453 212.102 107.508 216.562
 110.52 219.582 c 137.477 246.543 l 164.438 273.512 l 167.59 276.648 172.102
 277.531 175.953 276.227 c 196.805 269.27 268.059 243.332 309.406 201.973
 c 327.316 184.051 351.129 143.09 367.059 102.551 c 375.891 80.129 394.477
 25.992 376.262 7.754 c h
376.262 7.754 m f
0.94902 0.294118 0.235294 rg
175.949 276.227 m 196.801 269.273 268.059 243.336 309.406 201.973 c 327.312
 184.055 351.129 143.09 367.059 102.555 c 375.891 80.133 394.477 25.992 
376.262 7.758 c 137.477 246.543 l 164.438 273.512 l 167.59 276.648 172.102
 277.531 175.949 276.227 c h
175.949 276.227 m f
336.344 79.5 m 320.434 63.586 l 304.531 47.684 l 300.137 43.293 293.016
 43.293 288.621 47.684 c 284.227 52.078 284.227 59.199 288.621 63.594 c 
320.438 95.41 l 324.832 99.801 331.949 99.801 336.344 95.41 c 340.738 91.016
 340.738 83.895 336.344 79.5 c h
336.344 79.5 m f
288.609 95.41 m 272.691 79.5 l 268.297 75.105 261.18 75.105 256.785 79.5
 c 252.391 83.895 252.391 91.016 256.785 95.41 c 272.699 111.32 l 288.621
 127.234 l 293.016 131.629 300.137 131.629 304.531 127.234 c 308.922 122.84
 308.922 115.723 304.531 111.328 c h
288.609 95.41 m f
224.969 159.051 m 209.062 143.141 l 204.668 138.75 197.547 138.75 193.152
 143.141 c 188.762 147.535 188.762 154.656 193.152 159.051 c 209.062 174.957
 l 224.969 190.867 l 229.363 195.258 236.484 195.258 240.879 190.867 c 245.27
 186.473 245.27 179.352 240.879 174.957 c h
224.969 159.051 m f
193.152 190.863 m 177.246 174.957 l 172.852 170.562 165.734 170.562 161.34
 174.957 c 156.945 179.352 156.945 186.469 161.34 190.863 c 177.246 206.773
 l 193.152 222.68 l 197.547 227.074 204.668 227.074 209.062 222.68 c 213.457
 218.285 213.457 211.168 209.062 206.773 c h
193.152 190.863 m f
256.793 127.227 m 224.969 95.41 l 220.574 91.016 213.457 91.016 209.062
 95.41 c 204.668 99.801 204.668 106.922 209.062 111.316 c 240.887 143.133
 l 272.715 174.957 l 277.109 179.352 284.227 179.352 288.621 174.957 c 293.016
 170.562 293.016 163.445 288.621 159.051 c h
256.793 127.227 m f
0.8 0.160784 0.266667 rg
336.344 95.41 m 340.738 91.016 340.738 83.895 336.344 79.5 c 320.434 63.586
 l 304.523 79.496 l 320.438 95.41 l 324.832 99.805 331.949 99.805 336.344
 95.41 c h
336.344 95.41 m f
304.531 127.234 m 308.922 122.84 308.922 115.723 304.531 111.328 c 288.609
 95.41 l 272.699 111.32 l 288.621 127.234 l 293.016 131.629 300.137 131.629
 304.531 127.234 c h
304.531 127.234 m f
240.879 190.863 m 245.27 186.469 245.27 179.352 240.879 174.957 c 224.969
 159.051 l 209.062 174.957 l 224.969 190.863 l 229.363 195.258 236.484 195.258
 240.879 190.863 c h
240.879 190.863 m f
209.062 222.68 m 213.457 218.285 213.457 211.168 209.062 206.773 c 193.152
 190.863 l 177.246 206.773 l 193.152 222.68 l 197.551 227.074 204.668 227.074
 209.062 222.68 c h
209.062 222.68 m f
288.621 174.957 m 293.016 170.562 293.016 163.445 288.621 159.051 c 256.793
 127.227 l 240.887 143.133 l 272.715 174.957 l 277.109 179.352 284.227 179.352
 288.621 174.957 c h
288.621 174.957 m f
Q Q
showpage
%%Trailer
end
%%EOF
