%!PS-Adobe-3.0 EPSF-3.0
%%Creator: cairo 1.16.0 (https://cairographics.org)
%%CreationDate: Thu Apr  8 07:10:31 2021
%%Pages: 1
%%DocumentData: Clean7Bit
%%LanguageLevel: 2
%%BoundingBox: 0 0 384 384
%%EndComments
%%BeginProlog
50 dict begin
/q { gsave } bind def
/Q { grestore } bind def
/cm { 6 array astore concat } bind def
/w { setlinewidth } bind def
/J { setlinecap } bind def
/j { setlinejoin } bind def
/M { setmiterlimit } bind def
/d { setdash } bind def
/m { moveto } bind def
/l { lineto } bind def
/c { curveto } bind def
/h { closepath } bind def
/re { exch dup neg 3 1 roll 5 3 roll moveto 0 rlineto
      0 exch rlineto 0 rlineto closepath } bind def
/S { stroke } bind def
/f { fill } bind def
/f* { eofill } bind def
/n { newpath } bind def
/W { clip } bind def
/W* { eoclip } bind def
/BT { } bind def
/ET { } bind def
/BDC { mark 3 1 roll /BDC pdfmark } bind def
/EMC { mark /EMC pdfmark } bind def
/cairo_store_point { /cairo_point_y exch def /cairo_point_x exch def } def
/Tj { show currentpoint cairo_store_point } bind def
/TJ {
  {
    dup
    type /stringtype eq
    { show } { -0.001 mul 0 cairo_font_matrix dtransform rmoveto } ifelse
  } forall
  currentpoint cairo_store_point
} bind def
/cairo_selectfont { cairo_font_matrix aload pop pop pop 0 0 6 array astore
    cairo_font exch selectfont cairo_point_x cairo_point_y moveto } bind def
/Tf { pop /cairo_font exch def /cairo_font_matrix where
      { pop cairo_selectfont } if } bind def
/Td { matrix translate cairo_font_matrix matrix concatmatrix dup
      /cairo_font_matrix exch def dup 4 get exch 5 get cairo_store_point
      /cairo_font where { pop cairo_selectfont } if } bind def
/Tm { 2 copy 8 2 roll 6 array astore /cairo_font_matrix exch def
      cairo_store_point /cairo_font where { pop cairo_selectfont } if } bind def
/g { setgray } bind def
/rg { setrgbcolor } bind def
/d1 { setcachedevice } bind def
/cairo_data_source {
  CairoDataIndex CairoData length lt
    { CairoData CairoDataIndex get /CairoDataIndex CairoDataIndex 1 add def }
    { () } ifelse
} def
/cairo_flush_ascii85_file { cairo_ascii85_file status { cairo_ascii85_file flushfile } if } def
/cairo_image { image cairo_flush_ascii85_file } def
/cairo_imagemask { imagemask cairo_flush_ascii85_file } def
%%EndProlog
%%BeginSetup
%%EndSetup
%%Page: 1 1
%%BeginPageSetup
%%PageBoundingBox: 0 0 384 384
%%EndPageSetup
q 0 0 384 384 rectclip
1 0 0 -1 0 384 cm q
0.6 0.25098 0.180392 rg
327 67.5 m 304.5 67.5 l 298.281 67.5 293.25 62.469 293.25 56.25 c 293.25
 50.031 298.281 45 304.5 45 c 327 45 l 333.219 45 338.25 50.031 338.25 56.25
 c 338.25 62.469 333.219 67.5 327 67.5 c h
327 67.5 m f
0.701961 0.388235 0.282353 rg
225.75 56.25 m 225.75 62.551 220.801 67.5 214.5 67.5 c 11.25 67.5 l 4.949
 67.5 0 62.551 0 56.25 c 0 49.949 4.949 45 11.25 45 c 214.5 45 l 220.801
 45 225.75 49.949 225.75 56.25 c h
225.75 56.25 m f
0.6 0.25098 0.180392 rg
214.5 67.5 m 192 67.5 l 192 45 l 214.5 45 l 220.801 45 225.75 49.949 225.75
 56.25 c 225.75 62.551 220.801 67.5 214.5 67.5 c h
214.5 67.5 m f
1 0.6 0.2 rg
203.25 11.25 112.5 213.75 re f
1 0.882353 0.298039 rg
225.75 11.25 22.5 213.75 re f
270.75 11.25 22.5 213.75 re f
0.701961 0.388235 0.282353 rg
338.25 11.25 m 338.25 17.551 333.301 22.5 327 22.5 c 11.25 22.5 l 4.949
 22.5 0 17.551 0 11.25 c 0 4.949 4.949 0 11.25 0 c 327 0 l 333.301 0 338.25
 4.949 338.25 11.25 c h
338.25 11.25 m f
0.6 0.25098 0.180392 rg
327 22.5 m 192 22.5 l 192 0 l 327 0 l 333.301 0 338.25 4.949 338.25 11.25
 c 338.25 17.551 333.301 22.5 327 22.5 c h
327 22.5 m f
1 0.882353 0.298039 rg
192 92.707 m 184.742 91.055 177.262 90 169.5 90 c 113.582 90 68.25 135.332
 68.25 191.25 c 68.25 225 l 270.75 225 l 270.75 191.25 l 270.75 143.09 237.051
 102.965 192 92.707 c h
192 92.707 m f
1 0.74902 0.25098 rg
270.75 191.25 m 270.75 143.09 237.051 102.965 192 92.707 c 192 225 l 270.75
 225 l h
270.75 191.25 m f
192 116.172 m 184.824 114.012 177.371 112.5 169.5 112.5 c 126.082 112.5
 90.75 147.832 90.75 191.25 c 90.75 225 l 248.25 225 l 248.25 191.25 l 248.25
 155.703 224.414 125.926 192 116.172 c h
192 116.172 m f
1 0.6 0.2 rg
248.25 191.25 m 248.25 155.703 224.414 125.926 192 116.172 c 192 225 l 
248.25 225 l h
248.25 191.25 m f
1 0.882353 0.298039 rg
192 139.766 m 185.098 136.738 177.508 135 169.5 135 c 138.477 135 113.25
 160.234 113.25 191.25 c 113.25 225 l 225.75 225 l 225.75 191.25 l 225.75
 168.242 211.836 148.469 192 139.766 c h
192 139.766 m f
1 0.74902 0.25098 rg
225.75 191.25 m 225.75 168.242 211.836 148.469 192 139.766 c 192 225 l 
225.75 225 l h
225.75 191.25 m f
192 166.277 m 186.016 160.883 178.176 157.5 169.5 157.5 c 150.891 157.5
 135.75 172.641 135.75 191.25 c 135.75 225 l 203.25 225 l 203.25 191.25 
l 203.25 181.312 198.855 172.461 192 166.277 c h
192 166.277 m f
1 0.6 0.2 rg
203.25 191.25 m 203.25 181.312 198.855 172.461 192 166.277 c 192 225 l 
203.25 225 l h
203.25 191.25 m f
1 0.454902 0.34902 rg
372.75 202.5 m 11.25 202.5 l 4.949 202.5 0 207.449 0 213.75 c 0 270.227
 32.25 299.625 83.324 324.148 c 101.551 333.148 113.25 351.824 113.25 372.75
 c 113.25 379.051 118.199 384 124.5 384 c 259.5 384 l 265.801 384 270.75
 378.375 270.75 372.074 c 270.75 351.824 282.449 333.148 300.676 324.148
 c 351.75 299.625 384 270.227 384 213.75 c 384 207.449 379.051 202.5 372.75
 202.5 c h
372.75 202.5 m f
0.94902 0.294118 0.235294 rg
384 213.75 m 384 270.227 351.75 299.625 300.676 324.148 c 282.449 333.148
 270.75 351.824 270.75 372.074 c 270.75 378.375 265.801 384 259.5 384 c 
192 384 l 192 202.5 l 372.75 202.5 l 379.051 202.5 384 207.449 384 213.75
 c h
384 213.75 m f
Q Q
showpage
%%Trailer
end
%%EOF
