%!PS-Adobe-3.0 EPSF-3.0
%%Creator: cairo 1.16.0 (https://cairographics.org)
%%CreationDate: Thu Apr  8 07:10:24 2021
%%Pages: 1
%%DocumentData: Clean7Bit
%%LanguageLevel: 2
%%BoundingBox: 7 0 377 384
%%EndComments
%%BeginProlog
50 dict begin
/q { gsave } bind def
/Q { grestore } bind def
/cm { 6 array astore concat } bind def
/w { setlinewidth } bind def
/J { setlinecap } bind def
/j { setlinejoin } bind def
/M { setmiterlimit } bind def
/d { setdash } bind def
/m { moveto } bind def
/l { lineto } bind def
/c { curveto } bind def
/h { closepath } bind def
/re { exch dup neg 3 1 roll 5 3 roll moveto 0 rlineto
      0 exch rlineto 0 rlineto closepath } bind def
/S { stroke } bind def
/f { fill } bind def
/f* { eofill } bind def
/n { newpath } bind def
/W { clip } bind def
/W* { eoclip } bind def
/BT { } bind def
/ET { } bind def
/BDC { mark 3 1 roll /BDC pdfmark } bind def
/EMC { mark /EMC pdfmark } bind def
/cairo_store_point { /cairo_point_y exch def /cairo_point_x exch def } def
/Tj { show currentpoint cairo_store_point } bind def
/TJ {
  {
    dup
    type /stringtype eq
    { show } { -0.001 mul 0 cairo_font_matrix dtransform rmoveto } ifelse
  } forall
  currentpoint cairo_store_point
} bind def
/cairo_selectfont { cairo_font_matrix aload pop pop pop 0 0 6 array astore
    cairo_font exch selectfont cairo_point_x cairo_point_y moveto } bind def
/Tf { pop /cairo_font exch def /cairo_font_matrix where
      { pop cairo_selectfont } if } bind def
/Td { matrix translate cairo_font_matrix matrix concatmatrix dup
      /cairo_font_matrix exch def dup 4 get exch 5 get cairo_store_point
      /cairo_font where { pop cairo_selectfont } if } bind def
/Tm { 2 copy 8 2 roll 6 array astore /cairo_font_matrix exch def
      cairo_store_point /cairo_font where { pop cairo_selectfont } if } bind def
/g { setgray } bind def
/rg { setrgbcolor } bind def
/d1 { setcachedevice } bind def
/cairo_data_source {
  CairoDataIndex CairoData length lt
    { CairoData CairoDataIndex get /CairoDataIndex CairoDataIndex 1 add def }
    { () } ifelse
} def
/cairo_flush_ascii85_file { cairo_ascii85_file status { cairo_ascii85_file flushfile } if } def
/cairo_image { image cairo_flush_ascii85_file } def
/cairo_imagemask { imagemask cairo_flush_ascii85_file } def
%%EndProlog
%%BeginSetup
%%EndSetup
%%Page: 1 1
%%BeginPageSetup
%%PageBoundingBox: 7 0 377 384
%%EndPageSetup
q 7 0 370 384 rectclip
1 0 0 -1 0 384 cm q
0.301961 0.368627 0.501961 rg
77.281 333.762 m 77.273 333.75 77.266 333.742 77.262 333.73 c 72.852 327.035
 73.762 318.195 79.434 312.523 c 162.582 229.375 l 146.668 213.461 l 11.254
 348.875 l 6.855 353.273 6.855 360.391 11.254 364.789 c 27.168 380.703 l
 31.566 385.102 38.684 385.102 43.082 380.703 c 75.859 347.926 l 79.641 
344.141 80.242 338.227 77.281 333.762 c h
77.281 333.762 m f
0.239216 0.270588 0.4 rg
43.082 380.703 m 75.859 347.926 l 79.641 344.141 80.242 338.227 77.281 
333.762 c 77.273 333.75 77.266 333.738 77.262 333.73 c 72.852 327.035 73.762
 318.195 79.434 312.523 c 162.582 229.375 l 154.625 221.418 l 11.254 364.789
 l 27.168 380.703 l 31.566 385.102 38.684 385.102 43.082 380.703 c h
43.082 380.703 m f
1 0.882353 0.298039 rg
210.32 213.465 m 203.953 191.184 l 185.363 172.594 l 162.582 165.723 l 
153.793 156.934 139.543 156.934 130.754 165.723 c 114.844 181.637 l 106.055
 190.426 106.055 204.676 114.844 213.465 c 162.582 261.203 l 171.371 269.992
 185.621 269.992 194.406 261.203 c 210.32 245.289 l 219.109 236.5 219.109
 222.254 210.32 213.465 c h
210.32 213.465 m f
1 0.74902 0.25098 rg
194.406 261.203 m 210.32 245.289 l 219.109 236.5 219.109 222.254 210.32
 213.465 c 203.953 191.184 l 194.406 181.637 l 138.711 237.332 l 162.582
 261.203 l 171.371 269.992 185.621 269.992 194.406 261.203 c h
194.406 261.203 m f
1 0.454902 0.34902 rg
289.887 133.898 m 283.52 111.617 l 264.93 93.027 l 242.148 86.16 l 233.359
 77.371 219.109 77.371 210.32 86.16 c 194.406 102.07 l 185.621 110.859 185.621
 125.109 194.406 133.898 c 199.77 155.172 l 219.867 175.27 l 242.148 181.637
 l 250.938 190.426 265.188 190.426 273.973 181.637 c 289.887 165.723 l 298.676
 156.934 298.676 142.688 289.887 133.898 c h
289.887 133.898 m f
0.94902 0.294118 0.235294 rg
242.145 181.637 m 250.934 190.426 265.184 190.426 273.973 181.637 c 289.887
 165.723 l 298.676 156.934 298.676 142.688 289.887 133.898 c 283.52 111.617
 l 273.973 102.07 l 210.32 165.723 l 219.867 175.273 l h
242.145 181.637 m f
0.301961 0.368627 0.501961 rg
361.496 14.547 m 357.102 10.156 349.977 10.152 345.582 14.547 c 329.668
 30.461 l 325.277 34.855 325.277 41.98 329.668 46.375 c 334.062 50.77 341.188
 50.77 345.582 46.375 c 361.496 30.461 l 365.891 26.066 365.891 18.941 361.496
 14.547 c h
361.496 14.547 m f
0.239216 0.270588 0.4 rg
345.582 46.375 m 361.496 30.461 l 365.891 26.066 365.891 18.941 361.496
 14.547 c 329.668 46.375 l 334.062 50.77 341.188 50.77 345.582 46.375 c 
h
345.582 46.375 m f
1 0.882353 0.298039 rg
369.453 54.332 m 321.711 6.59 l 312.922 -2.195 298.676 -2.195 289.887 6.59
 c 273.973 22.504 l 265.184 31.293 265.184 45.543 273.973 54.332 c 279.332
 75.605 l 289.887 86.156 l 299.434 95.703 l 321.711 102.07 l 330.5 110.859
 344.75 110.859 353.539 102.07 c 369.449 86.156 l 378.242 77.367 378.242
 63.121 369.453 54.332 c h
369.453 54.332 m f
1 0.74902 0.25098 rg
321.711 102.07 m 330.5 110.859 344.75 110.859 353.539 102.07 c 369.453 
86.156 l 378.242 77.367 378.242 63.121 369.453 54.332 c 345.582 30.461 l
 289.887 86.156 l 299.434 95.703 l h
321.711 102.07 m f
0.596078 0.85098 0.341176 rg
345.582 125.941 m 297.844 78.199 l 250.102 30.461 l 245.707 26.066 238.586
 26.066 234.191 30.461 c 218.277 46.375 l 213.883 50.77 213.883 57.895 218.277
 62.289 c 266.016 110.027 l 313.758 157.766 l 318.148 162.16 325.277 162.16
 329.668 157.766 c 345.582 141.855 l 349.977 137.461 349.977 130.336 345.582
 125.941 c h
345.582 125.941 m f
0.4 0.74902 0.223529 rg
329.668 157.766 m 345.582 141.855 l 349.977 137.461 349.977 130.336 345.582
 125.941 c 297.844 78.203 l 266.016 110.027 l 313.758 157.766 l 318.148 
162.16 325.273 162.16 329.668 157.766 c h
329.668 157.766 m f
0.596078 0.85098 0.341176 rg
266.016 205.508 m 218.277 157.766 l 170.535 110.027 l 166.145 105.633 159.02
 105.633 154.625 110.027 c 138.711 125.941 l 134.316 130.332 134.316 137.461
 138.711 141.852 c 186.449 189.594 l 234.191 237.332 l 238.582 241.727 245.711
 241.727 250.102 237.332 c 266.016 221.418 l 270.41 217.023 270.41 209.902
 266.016 205.508 c h
266.016 205.508 m f
0.4 0.74902 0.223529 rg
250.102 237.332 m 266.016 221.422 l 270.41 217.023 270.41 209.902 266.016
 205.508 c 218.277 157.766 l 186.449 189.594 l 234.191 237.332 l 238.582
 241.727 245.707 241.727 250.102 237.332 c h
250.102 237.332 m f
Q Q
showpage
%%Trailer
end
%%EOF
