%!PS-Adobe-3.0 EPSF-3.0
%%Creator: cairo 1.16.0 (https://cairographics.org)
%%CreationDate: Thu Apr  8 07:10:18 2021
%%Pages: 1
%%DocumentData: Clean7Bit
%%LanguageLevel: 2
%%BoundingBox: 0 0 384 384
%%EndComments
%%BeginProlog
50 dict begin
/q { gsave } bind def
/Q { grestore } bind def
/cm { 6 array astore concat } bind def
/w { setlinewidth } bind def
/J { setlinecap } bind def
/j { setlinejoin } bind def
/M { setmiterlimit } bind def
/d { setdash } bind def
/m { moveto } bind def
/l { lineto } bind def
/c { curveto } bind def
/h { closepath } bind def
/re { exch dup neg 3 1 roll 5 3 roll moveto 0 rlineto
      0 exch rlineto 0 rlineto closepath } bind def
/S { stroke } bind def
/f { fill } bind def
/f* { eofill } bind def
/n { newpath } bind def
/W { clip } bind def
/W* { eoclip } bind def
/BT { } bind def
/ET { } bind def
/BDC { mark 3 1 roll /BDC pdfmark } bind def
/EMC { mark /EMC pdfmark } bind def
/cairo_store_point { /cairo_point_y exch def /cairo_point_x exch def } def
/Tj { show currentpoint cairo_store_point } bind def
/TJ {
  {
    dup
    type /stringtype eq
    { show } { -0.001 mul 0 cairo_font_matrix dtransform rmoveto } ifelse
  } forall
  currentpoint cairo_store_point
} bind def
/cairo_selectfont { cairo_font_matrix aload pop pop pop 0 0 6 array astore
    cairo_font exch selectfont cairo_point_x cairo_point_y moveto } bind def
/Tf { pop /cairo_font exch def /cairo_font_matrix where
      { pop cairo_selectfont } if } bind def
/Td { matrix translate cairo_font_matrix matrix concatmatrix dup
      /cairo_font_matrix exch def dup 4 get exch 5 get cairo_store_point
      /cairo_font where { pop cairo_selectfont } if } bind def
/Tm { 2 copy 8 2 roll 6 array astore /cairo_font_matrix exch def
      cairo_store_point /cairo_font where { pop cairo_selectfont } if } bind def
/g { setgray } bind def
/rg { setrgbcolor } bind def
/d1 { setcachedevice } bind def
/cairo_data_source {
  CairoDataIndex CairoData length lt
    { CairoData CairoDataIndex get /CairoDataIndex CairoDataIndex 1 add def }
    { () } ifelse
} def
/cairo_flush_ascii85_file { cairo_ascii85_file status { cairo_ascii85_file flushfile } if } def
/cairo_image { image cairo_flush_ascii85_file } def
/cairo_imagemask { imagemask cairo_flush_ascii85_file } def
%%EndProlog
%%BeginSetup
%%EndSetup
%%Page: 1 1
%%BeginPageSetup
%%PageBoundingBox: 0 0 384 384
%%EndPageSetup
q 0 0 384 384 rectclip
1 0 0 -1 0 384 cm q
0.952941 0.960784 0.976471 rg
384 192 m 384 298.039 298.039 384 192 384 c 85.961 384 0 298.039 0 192 
c 0 85.961 85.961 0 192 0 c 298.039 0 384 85.961 384 192 c h
384 192 m f
0.882353 0.901961 0.941176 rg
384 192 m 384 86.375 297.625 0 192 0 c 192 384 l 297.625 384 384 297.625
 384 192 c h
384 192 m f
0.596078 0.85098 0.341176 rg
338.031 183.871 m 337.285 170.688 332.055 158.504 323.176 148.922 c 324.648
 135.902 321.617 122.984 314.41 111.965 c 307.18 100.914 296.566 92.957 
284.066 89.113 c 278.859 77.129 269.785 67.449 257.984 61.48 c 246.184 55.527
 232.957 53.945 220.281 56.867 c 211.984 50.695 202.191 47.094 192 46.207
 c 189.312 45.973 186.613 45.816 183.891 45.98 c 170.711 46.707 158.516 
51.926 148.934 60.836 c 135.883 59.309 123.027 62.363 111.977 69.59 c 100.926
 76.82 92.969 87.445 89.125 99.945 c 77.105 105.152 67.438 114.23 61.484
 126.027 c 55.527 137.828 53.945 151 56.871 163.734 c 49.09 174.234 45.246
 186.938 45.973 200.129 c 46.719 213.312 51.949 225.508 60.824 235.078 c
 59.352 248.086 62.387 261.004 69.59 272.035 c 76.82 283.086 87.434 291.043
 99.938 294.887 c 105.145 306.871 114.219 316.551 126.016 322.52 c 137.816
 328.473 151.043 330.043 163.723 327.133 c 172.207 333.434 182.051 336.941
 192 337.812 c 194.703 338.051 197.414 338.188 200.109 338.02 c 213.293 
337.293 225.488 332.074 235.066 323.164 c 248.141 324.691 260.973 321.641
 272.023 314.41 c 283.078 307.18 291.031 296.559 294.875 284.055 c 306.895
 278.848 316.562 269.773 322.52 257.973 c 328.473 246.176 330.055 233 327.133
 220.277 c 334.91 209.766 338.754 197.066 338.031 183.891 c 338.031 183.883
 338.031 183.871 338.031 183.871 c h
338.031 183.871 m f
0.4 0.74902 0.223529 rg
235.066 323.164 m 248.141 324.691 260.973 321.641 272.023 314.41 c 283.078
 307.18 291.031 296.559 294.875 284.055 c 306.895 278.848 316.562 269.773
 322.516 257.973 c 328.473 246.176 330.055 233 327.133 220.277 c 334.91 
209.766 338.754 197.066 338.031 183.891 c 338.031 183.879 338.031 183.871
 338.031 183.871 c 337.281 170.688 332.055 158.504 323.176 148.922 c 324.648
 135.902 321.617 122.984 314.41 111.965 c 307.18 100.914 296.566 92.957 
284.066 89.113 c 278.859 77.129 269.781 67.449 257.984 61.48 c 246.184 55.527
 232.957 53.945 220.277 56.867 c 211.984 50.695 202.188 47.094 192 46.207
 c 192 337.812 l 194.703 338.051 197.414 338.188 200.109 338.02 c 213.293
 337.293 225.484 332.074 235.066 323.164 c h
235.066 323.164 m f
203.25 282 m 203.25 288.215 198.215 293.25 192 293.25 c 185.785 293.25 
180.75 288.215 180.75 282 c 180.75 275.785 185.785 270.75 192 270.75 c 198.215
 270.75 203.25 275.785 203.25 282 c h
203.25 282 m f
244.953 116.547 m 234.062 105.617 210.762 97.418 192 104.207 c 181.871 
107.875 169.941 116.621 161.574 136.449 c 129.695 139.922 115.441 162.711
 114.809 163.766 c 111.645 169.117 113.426 176.016 118.766 179.18 c 124.105
 182.332 131.004 180.586 134.188 175.234 c 134.277 175.059 144.914 158.25
 169.5 158.25 c 179.098 158.25 186.477 160.785 192 163.883 c 200.562 168.688
 204.582 174.867 204.809 175.234 c 207.992 180.59 214.895 182.336 220.234
 179.18 c 225.574 176.016 227.352 169.117 224.188 163.766 c 223.664 162.887
 213.586 147.094 192 139.715 c 190.074 139.055 188.199 138.355 186.086 137.848
 c 187.871 134.906 189.902 132.684 192 130.648 c 203.691 119.301 221.758
 125.137 229.047 132.457 c 233.441 136.848 240.559 136.84 244.953 132.465
 c 249.348 128.07 249.348 120.953 244.953 116.547 c h
244.953 116.547 m f
214.5 225.75 m 205.824 225.75 197.984 222.367 192 216.973 c 185.145 210.789
 180.75 201.938 180.75 192 c 180.75 185.781 175.719 180.75 169.5 180.75 
c 163.281 180.75 158.25 185.781 158.25 192 c 158.25 203.98 162.082 215.051
 168.492 224.184 c 157.066 231.801 142.312 233.328 129.531 226.938 c 123.973
 224.191 117.25 226.422 114.438 231.969 c 111.668 237.527 113.91 244.285
 119.469 247.062 c 140.246 257.453 165.734 255.555 185.34 239.867 c 187.406
 241.129 189.781 241.832 192 242.84 c 198.945 245.992 206.379 248.25 214.5
 248.25 c 220.719 248.25 225.75 243.219 225.75 237 c 225.75 230.781 220.719
 225.75 214.5 225.75 c h
214.5 225.75 m f
0.160784 0.65098 0.0627451 rg
203.25 282 m 203.25 275.785 198.215 270.75 192 270.75 c 192 293.25 l 198.215
 293.25 203.25 288.215 203.25 282 c h
203.25 282 m f
204.809 175.234 m 207.992 180.59 214.895 182.336 220.234 179.18 c 225.574
 176.016 227.352 169.117 224.188 163.766 c 223.664 162.887 213.586 147.094
 192 139.715 c 192 163.883 l 200.562 168.688 204.582 174.867 204.809 175.234
 c h
204.809 175.234 m f
229.047 132.453 m 233.441 136.848 240.559 136.836 244.953 132.465 c 249.348
 128.07 249.348 120.949 244.953 116.547 c 234.062 105.617 210.766 97.414
 192 104.207 c 192 130.648 l 203.691 119.301 221.762 125.137 229.047 132.453
 c h
229.047 132.453 m f
225.75 237 m 225.75 230.781 220.719 225.75 214.5 225.75 c 205.824 225.75
 197.984 222.367 192 216.973 c 192 242.84 l 198.945 245.992 206.379 248.25
 214.5 248.25 c 220.719 248.25 225.75 243.219 225.75 237 c h
225.75 237 m f
265.277 159.855 m 260.027 156.68 253.062 158.371 249.855 163.711 c 246.648
 169.039 248.383 175.949 253.723 179.148 c 262.27 184.277 267.367 193.285
 267.367 203.25 c 267.367 213.215 262.27 222.223 253.723 227.355 c 248.383
 230.551 246.645 237.461 249.855 242.789 c 253.082 248.172 260.031 249.816
 265.277 246.648 c 280.68 237.418 289.867 221.203 289.867 203.25 c 289.867
 185.301 280.68 169.082 265.277 159.855 c h
265.277 159.855 m f
Q Q
showpage
%%Trailer
end
%%EOF
