%!PS-Adobe-3.0 EPSF-3.0
%%Creator: cairo 1.16.0 (https://cairographics.org)
%%CreationDate: Thu Apr  8 07:10:16 2021
%%Pages: 1
%%DocumentData: Clean7Bit
%%LanguageLevel: 2
%%BoundingBox: 0 0 384 384
%%EndComments
%%BeginProlog
50 dict begin
/q { gsave } bind def
/Q { grestore } bind def
/cm { 6 array astore concat } bind def
/w { setlinewidth } bind def
/J { setlinecap } bind def
/j { setlinejoin } bind def
/M { setmiterlimit } bind def
/d { setdash } bind def
/m { moveto } bind def
/l { lineto } bind def
/c { curveto } bind def
/h { closepath } bind def
/re { exch dup neg 3 1 roll 5 3 roll moveto 0 rlineto
      0 exch rlineto 0 rlineto closepath } bind def
/S { stroke } bind def
/f { fill } bind def
/f* { eofill } bind def
/n { newpath } bind def
/W { clip } bind def
/W* { eoclip } bind def
/BT { } bind def
/ET { } bind def
/BDC { mark 3 1 roll /BDC pdfmark } bind def
/EMC { mark /EMC pdfmark } bind def
/cairo_store_point { /cairo_point_y exch def /cairo_point_x exch def } def
/Tj { show currentpoint cairo_store_point } bind def
/TJ {
  {
    dup
    type /stringtype eq
    { show } { -0.001 mul 0 cairo_font_matrix dtransform rmoveto } ifelse
  } forall
  currentpoint cairo_store_point
} bind def
/cairo_selectfont { cairo_font_matrix aload pop pop pop 0 0 6 array astore
    cairo_font exch selectfont cairo_point_x cairo_point_y moveto } bind def
/Tf { pop /cairo_font exch def /cairo_font_matrix where
      { pop cairo_selectfont } if } bind def
/Td { matrix translate cairo_font_matrix matrix concatmatrix dup
      /cairo_font_matrix exch def dup 4 get exch 5 get cairo_store_point
      /cairo_font where { pop cairo_selectfont } if } bind def
/Tm { 2 copy 8 2 roll 6 array astore /cairo_font_matrix exch def
      cairo_store_point /cairo_font where { pop cairo_selectfont } if } bind def
/g { setgray } bind def
/rg { setrgbcolor } bind def
/d1 { setcachedevice } bind def
/cairo_data_source {
  CairoDataIndex CairoData length lt
    { CairoData CairoDataIndex get /CairoDataIndex CairoDataIndex 1 add def }
    { () } ifelse
} def
/cairo_flush_ascii85_file { cairo_ascii85_file status { cairo_ascii85_file flushfile } if } def
/cairo_image { image cairo_flush_ascii85_file } def
/cairo_imagemask { imagemask cairo_flush_ascii85_file } def
%%EndProlog
%%BeginSetup
%%EndSetup
%%Page: 1 1
%%BeginPageSetup
%%PageBoundingBox: 0 0 384 384
%%EndPageSetup
q 0 0 384 384 rectclip
1 0 0 -1 0 384 cm q
0.4 0.74902 0.223529 rg
380.641 3.359 m 379.652 2.395 378.52 1.574 377.219 0.973 c 372.934 -1.016
 367.57 0.148 364.254 3.5 c 355.793 11.98 343.699 15.023 330.473 10.43 c
 300.281 -0.008 264.18 9.805 238.473 35.512 c 227.113 46.859 218.566 60.484
 213.773 74.887 c 209.645 87.289 199.977 96.133 188.527 97.969 c 166.402
 101.492 145.727 112.336 128.762 129.312 c 111.801 146.266 100.969 166.895
 97.406 188.988 c 95.605 200.371 86.793 210.004 74.422 214.137 c 60.074 
218.949 46.52 227.461 35.203 238.777 c 9.516 264.465 -0.328 300.578 10.109
 330.777 c 14.727 344.051 12.324 355.777 3.383 364.719 c -0.004 368.039 
-0.945 373.113 1.008 377.43 c 1.57 378.652 2.316 379.805 3.254 380.746 c
 5.473 382.965 8.652 384.219 12.172 383.969 c 86.551 379.105 l 108.395 377.293
 129.707 367.012 146.559 350.148 c 157.855 338.844 166.379 325.285 171.215
 310.914 c 175.344 298.555 184.969 289.742 196.352 287.922 c 218.453 284.383
 239.086 273.539 256.027 256.59 c 273.012 239.613 283.867 218.938 287.383
 196.824 c 289.207 185.375 298.062 175.695 310.477 171.566 c 310.477 171.555
 310.477 171.555 310.477 171.555 c 324.91 166.742 338.512 158.207 349.828
 146.879 c 366.684 130.035 376.965 108.723 378.789 86.859 c 383.965 11.828
 l 384.238 8.559 382.891 5.559 380.641 3.359 c h
380.641 3.359 m f
0.160784 0.65098 0.0627451 rg
12.172 383.969 m 86.551 379.109 l 108.395 377.297 129.707 367.012 146.559
 350.148 c 157.855 338.844 166.379 325.285 171.215 310.914 c 175.344 298.555
 184.969 289.746 196.352 287.922 c 218.453 284.383 239.086 273.539 256.027
 256.59 c 273.012 239.613 283.867 218.938 287.383 196.824 c 289.207 185.375
 298.062 175.695 310.477 171.566 c 310.477 171.555 310.477 171.555 310.477
 171.555 c 324.91 166.742 338.512 158.207 349.828 146.879 c 366.684 130.039
 376.965 108.723 378.789 86.863 c 383.965 11.828 l 384.238 8.559 382.891
 5.559 380.641 3.359 c 3.254 380.746 l 5.473 382.969 8.652 384.219 12.172
 383.969 c h
12.172 383.969 m f
0.596078 0.85098 0.341176 rg
66.953 270.66 m 49.422 288.203 45.859 312.066 58.414 325.586 c 73.332 341.605
 99.039 334.035 114.699 318.375 c 130.699 302.367 137.719 276.848 121.891
 262.109 c 108.391 249.535 84.508 253.109 66.953 270.66 c h
66.953 270.66 m f
160.578 161.129 m 138.941 182.766 135.258 214.277 152.035 231.965 c 171.145
 252.129 204.312 244.637 224.211 224.773 c 244.547 204.434 251.312 171.441
 231.41 152.59 c 213.734 135.852 182.262 139.488 160.578 161.129 c h
160.578 161.129 m f
325.207 58.793 m 311.711 46.234 287.844 49.793 270.289 67.328 c 254.324
 83.289 248.094 107.621 261.754 122.246 c 276.809 138.312 302.449 130.617
 318.012 115.051 c 333.539 99.547 341.414 73.863 325.207 58.793 c h
325.207 58.793 m f
0.4 0.74902 0.223529 rg
114.699 318.375 m 130.699 302.367 137.723 276.848 121.891 262.109 c 58.414
 325.586 l 73.328 341.609 99.039 334.039 114.699 318.375 c h
114.699 318.375 m f
318.012 115.051 m 333.539 99.547 341.41 73.863 325.207 58.793 c 261.754
 122.246 l 276.809 138.312 302.449 130.617 318.012 115.051 c h
318.012 115.051 m f
224.211 224.773 m 244.547 204.438 251.312 171.445 231.41 152.59 c 152.035
 231.965 l 171.145 252.133 204.312 244.637 224.211 224.773 c h
224.211 224.773 m f
Q Q
showpage
%%Trailer
end
%%EOF
