%!PS-Adobe-3.0 EPSF-3.0
%%Creator: cairo 1.16.0 (https://cairographics.org)
%%CreationDate: Thu Apr  8 07:10:36 2021
%%Pages: 1
%%DocumentData: Clean7Bit
%%LanguageLevel: 2
%%BoundingBox: 0 34 384 350
%%EndComments
%%BeginProlog
50 dict begin
/q { gsave } bind def
/Q { grestore } bind def
/cm { 6 array astore concat } bind def
/w { setlinewidth } bind def
/J { setlinecap } bind def
/j { setlinejoin } bind def
/M { setmiterlimit } bind def
/d { setdash } bind def
/m { moveto } bind def
/l { lineto } bind def
/c { curveto } bind def
/h { closepath } bind def
/re { exch dup neg 3 1 roll 5 3 roll moveto 0 rlineto
      0 exch rlineto 0 rlineto closepath } bind def
/S { stroke } bind def
/f { fill } bind def
/f* { eofill } bind def
/n { newpath } bind def
/W { clip } bind def
/W* { eoclip } bind def
/BT { } bind def
/ET { } bind def
/BDC { mark 3 1 roll /BDC pdfmark } bind def
/EMC { mark /EMC pdfmark } bind def
/cairo_store_point { /cairo_point_y exch def /cairo_point_x exch def } def
/Tj { show currentpoint cairo_store_point } bind def
/TJ {
  {
    dup
    type /stringtype eq
    { show } { -0.001 mul 0 cairo_font_matrix dtransform rmoveto } ifelse
  } forall
  currentpoint cairo_store_point
} bind def
/cairo_selectfont { cairo_font_matrix aload pop pop pop 0 0 6 array astore
    cairo_font exch selectfont cairo_point_x cairo_point_y moveto } bind def
/Tf { pop /cairo_font exch def /cairo_font_matrix where
      { pop cairo_selectfont } if } bind def
/Td { matrix translate cairo_font_matrix matrix concatmatrix dup
      /cairo_font_matrix exch def dup 4 get exch 5 get cairo_store_point
      /cairo_font where { pop cairo_selectfont } if } bind def
/Tm { 2 copy 8 2 roll 6 array astore /cairo_font_matrix exch def
      cairo_store_point /cairo_font where { pop cairo_selectfont } if } bind def
/g { setgray } bind def
/rg { setrgbcolor } bind def
/d1 { setcachedevice } bind def
/cairo_data_source {
  CairoDataIndex CairoData length lt
    { CairoData CairoDataIndex get /CairoDataIndex CairoDataIndex 1 add def }
    { () } ifelse
} def
/cairo_flush_ascii85_file { cairo_ascii85_file status { cairo_ascii85_file flushfile } if } def
/cairo_image { image cairo_flush_ascii85_file } def
/cairo_imagemask { imagemask cairo_flush_ascii85_file } def
%%EndProlog
%%BeginSetup
%%EndSetup
%%Page: 1 1
%%BeginPageSetup
%%PageBoundingBox: 0 34 384 350
%%EndPageSetup
q 0 34 384 316 rectclip
1 0 0 -1 0 384 cm q
0.94902 0.294118 0.235294 rg
180.816 39.555 m 166.512 48.824 l 158.316 36.441 l 140.27 34.602 126.164
 34.5 124.5 34.5 c 122.664 34.5 118.586 34.551 113.25 34.75 c 104.539 46.578
 l 90.75 36.25 l 76.871 37.602 60.77 40.008 46.016 44.234 c 35.91 59.484
 l 23.535 53.137 l 10.109 60.352 0 70.273 0 84.18 c 0 158.25 l 0 164.469
 5.031 169.5 11.25 169.5 c 68.25 169.5 l 80.566 158.25 l 90.75 169.5 l 135.75
 169.5 l 146.645 158.25 l 158.25 169.5 l 203.25 169.5 l 213.258 158.25 l
 225.75 169.5 l 237 169.5 l 243.219 169.5 248.25 164.469 248.25 158.25 c
 248.25 84.18 l 248.25 57.602 213.512 45.301 180.816 39.555 c h
180.816 39.555 m f
0.8 0.160784 0.266667 rg
146.645 158.25 m 158.25 169.5 l 203.25 169.5 l 213.258 158.25 l 225.75 
169.5 l 237 169.5 l 243.219 169.5 248.25 164.469 248.25 158.25 c 248.25 
84.18 l 248.25 57.602 213.512 45.301 180.816 39.555 c 166.512 48.824 l 158.316
 36.441 l 140.27 34.602 126.164 34.5 124.5 34.5 c 124.5 169.5 l 135.75 169.5
 l h
146.645 158.25 m f
1 0.454902 0.34902 rg
133.266 94.98 m 130.117 91.043 127.203 87.176 124.5 83.188 c 118.004 73.613
 113.266 62.945 113.25 45.969 c 113.25 34.75 l 107.223 34.973 99.512 35.395
 90.75 36.25 c 90.75 45.98 l 90.793 77.906 104.02 94.453 115.711 109.043
 c 118.871 112.992 121.789 116.871 124.5 120.871 c 131.004 130.473 135.75
 141.188 135.75 158.25 c 135.75 169.5 l 158.25 169.5 l 158.25 158.25 l 158.25
 126.191 144.98 109.613 133.266 94.98 c h
133.266 94.98 m f
0.94902 0.294118 0.235294 rg
135.75 169.5 m 158.25 169.5 l 158.25 158.25 l 158.25 126.191 144.98 109.613
 133.266 94.98 c 130.117 91.043 127.203 87.176 124.5 83.188 c 124.5 120.871
 l 131.004 130.473 135.75 141.188 135.75 158.25 c h
135.75 169.5 m f
200.461 95.254 m 190.219 82.641 181.363 71.754 180.816 50.926 c 180.816
 39.555 l 173.012 38.18 165.387 37.164 158.316 36.441 c 158.316 51.223 l
 159.086 79.996 171.785 95.648 183.012 109.449 c 193.867 122.82 203.25 134.355
 203.25 158.25 c 203.25 169.5 l 225.75 169.5 l 225.75 158.25 l 225.75 126.367
 212.324 109.844 200.461 95.254 c h
200.461 95.254 m f
1 0.454902 0.34902 rg
65.152 95.605 m 55.418 83.805 47.004 73.621 46.016 55.902 c 46.016 44.234
 l 37.848 46.574 30.227 49.539 23.535 53.137 c 23.535 56.516 l 24.941 82.234
 37.094 96.957 47.816 109.934 c 58.781 123.215 68.25 134.684 68.25 158.25
 c 68.25 169.5 l 90.75 169.5 l 90.75 158.25 l 90.75 126.586 77.148 110.129
 65.152 95.605 c h
65.152 95.605 m f
0.94902 0.294118 0.235294 rg
248.316 129.555 m 234.012 138.824 l 225.816 126.441 l 207.77 124.602 193.664
 124.5 192 124.5 c 190.164 124.5 186.086 124.551 180.75 124.75 c 172.039
 136.578 l 158.25 126.25 l 144.371 127.602 128.27 130.008 113.516 134.234
 c 103.414 149.484 l 91.035 143.137 l 77.609 150.352 68.25 160.273 68.25
 174.18 c 68.25 248.25 l 68.25 254.469 73.281 259.5 79.5 259.5 c 135.75 
259.5 l 148.066 248.25 l 158.25 259.5 l 203.25 259.5 l 214.145 248.25 l 
225.75 259.5 l 270.75 259.5 l 280.758 248.25 l 293.25 259.5 l 304.5 259.5
 l 310.719 259.5 315.75 254.469 315.75 248.25 c 315.75 174.18 l 315.75 147.602
 281.012 135.301 248.316 129.555 c h
248.316 129.555 m f
0.8 0.160784 0.266667 rg
214.145 248.25 m 225.75 259.5 l 270.75 259.5 l 280.758 248.25 l 293.25 
259.5 l 304.5 259.5 l 310.719 259.5 315.75 254.469 315.75 248.25 c 315.75
 174.18 l 315.75 147.602 281.012 135.301 248.316 129.555 c 234.012 138.824
 l 225.816 126.441 l 207.77 124.602 193.664 124.5 192 124.5 c 192 259.5 
l 203.25 259.5 l h
214.145 248.25 m f
1 0.454902 0.34902 rg
200.766 184.98 m 197.617 181.043 194.703 177.176 192 173.188 c 185.504 
163.613 180.766 152.945 180.75 135.969 c 180.75 124.75 l 174.723 124.973
 167.012 125.398 158.25 126.25 c 158.25 135.98 l 158.293 167.906 171.52 
184.453 183.211 199.043 c 186.371 202.992 189.289 206.871 192 210.871 c 
198.504 220.473 203.25 231.188 203.25 248.25 c 203.25 259.5 l 225.75 259.5
 l 225.75 248.25 l 225.75 216.191 212.48 199.613 200.766 184.98 c h
200.766 184.98 m f
0.94902 0.294118 0.235294 rg
203.25 259.5 m 225.75 259.5 l 225.75 248.25 l 225.75 216.191 212.48 199.613
 200.766 184.98 c 197.617 181.043 194.703 177.176 192 173.188 c 192 210.871
 l 198.504 220.473 203.25 231.188 203.25 248.25 c h
203.25 259.5 m f
267.961 185.254 m 257.719 172.641 248.863 161.754 248.316 140.926 c 248.316
 129.555 l 240.512 128.18 232.887 127.164 225.816 126.441 c 225.816 141.223
 l 226.586 169.996 239.285 185.652 250.512 199.449 c 261.367 212.82 270.75
 224.355 270.75 248.25 c 270.75 259.5 l 293.25 259.5 l 293.25 248.25 l 293.25
 216.367 279.824 199.844 267.961 185.254 c h
267.961 185.254 m f
1 0.454902 0.34902 rg
132.652 185.605 m 122.918 173.809 114.504 163.621 113.512 145.902 c 113.512
 134.234 l 105.348 136.574 97.727 139.539 91.035 143.137 c 91.035 146.516
 l 92.441 172.234 104.594 186.957 115.316 199.934 c 126.281 213.215 135.75
 224.684 135.75 248.25 c 135.75 259.5 l 158.25 259.5 l 158.25 248.25 l 158.25
 216.586 144.648 200.129 132.652 185.605 c h
132.652 185.605 m f
0.94902 0.294118 0.235294 rg
315.816 219.555 m 301.512 228.824 l 293.316 216.441 l 275.27 214.602 261.164
 214.5 259.5 214.5 c 257.664 214.5 253.586 214.551 248.25 214.75 c 239.539
 226.578 l 225.75 216.25 l 211.871 217.602 195.77 220.008 181.016 224.234
 c 170.914 239.484 l 158.535 233.137 l 145.109 240.352 135.75 250.273 135.75
 264.18 c 135.75 338.25 l 135.75 344.469 140.781 349.5 147 349.5 c 203.25
 349.5 l 215.566 338.25 l 225.75 349.5 l 270.75 349.5 l 281.645 338.25 l
 293.25 349.5 l 338.25 349.5 l 348.258 338.25 l 360.75 349.5 l 372.75 349.5
 l 378.969 349.5 384 344.469 384 338.25 c 384 264.18 l 384 237.602 348.512
 225.301 315.816 219.555 c h
315.816 219.555 m f
0.8 0.160784 0.266667 rg
281.645 338.25 m 293.25 349.5 l 338.25 349.5 l 348.258 338.25 l 360.75 
349.5 l 372.75 349.5 l 378.969 349.5 384 344.469 384 338.25 c 384 264.18
 l 384 237.602 348.512 225.301 315.816 219.555 c 301.512 228.824 l 293.316
 216.441 l 275.27 214.602 261.164 214.5 259.5 214.5 c 259.5 349.5 l 270.75
 349.5 l h
281.645 338.25 m f
1 0.454902 0.34902 rg
268.266 274.98 m 265.117 271.043 262.203 267.176 259.5 263.188 c 253.004
 253.613 248.266 242.945 248.25 225.969 c 248.25 214.75 l 242.223 214.973
 234.512 215.398 225.75 216.25 c 225.75 225.98 l 225.793 257.906 239.02 
274.453 250.711 289.043 c 253.871 292.992 256.789 296.871 259.5 300.871 
c 266.004 310.473 270.75 321.188 270.75 338.25 c 270.75 349.5 l 293.25 349.5
 l 293.25 338.25 l 293.25 306.191 279.98 289.613 268.266 274.98 c h
268.266 274.98 m f
0.94902 0.294118 0.235294 rg
270.75 349.5 m 293.25 349.5 l 293.25 338.25 l 293.25 306.191 279.98 289.613
 268.266 274.98 c 265.117 271.043 262.203 267.176 259.5 263.188 c 259.5 
300.871 l 266.004 310.473 270.75 321.188 270.75 338.25 c h
270.75 349.5 m f
335.461 275.254 m 325.219 262.641 316.363 251.754 315.816 230.926 c 315.816
 219.555 l 308.012 218.18 300.387 217.164 293.316 216.441 c 293.316 231.223
 l 294.086 259.996 306.785 275.652 318.012 289.449 c 328.867 302.82 338.25
 314.355 338.25 338.25 c 338.25 349.5 l 360.75 349.5 l 360.75 338.25 l 360.75
 306.367 347.324 289.844 335.461 275.254 c h
335.461 275.254 m f
1 0.454902 0.34902 rg
200.152 275.605 m 190.418 263.809 182.004 253.621 181.012 235.902 c 181.012
 224.234 l 172.848 226.574 165.227 229.539 158.535 233.137 c 158.535 236.516
 l 159.941 262.234 172.094 276.957 182.816 289.934 c 193.781 303.215 203.25
 314.684 203.25 338.25 c 203.25 349.5 l 225.75 349.5 l 225.75 338.25 l 225.75
 306.586 212.148 290.129 200.152 275.605 c h
200.152 275.605 m f
Q Q
showpage
%%Trailer
end
%%EOF
