%!PS-Adobe-3.0 EPSF-3.0
%%Creator: cairo 1.16.0 (https://cairographics.org)
%%CreationDate: Thu Apr  8 07:10:35 2021
%%Pages: 1
%%DocumentData: Clean7Bit
%%LanguageLevel: 2
%%BoundingBox: 0 0 384 384
%%EndComments
%%BeginProlog
50 dict begin
/q { gsave } bind def
/Q { grestore } bind def
/cm { 6 array astore concat } bind def
/w { setlinewidth } bind def
/J { setlinecap } bind def
/j { setlinejoin } bind def
/M { setmiterlimit } bind def
/d { setdash } bind def
/m { moveto } bind def
/l { lineto } bind def
/c { curveto } bind def
/h { closepath } bind def
/re { exch dup neg 3 1 roll 5 3 roll moveto 0 rlineto
      0 exch rlineto 0 rlineto closepath } bind def
/S { stroke } bind def
/f { fill } bind def
/f* { eofill } bind def
/n { newpath } bind def
/W { clip } bind def
/W* { eoclip } bind def
/BT { } bind def
/ET { } bind def
/BDC { mark 3 1 roll /BDC pdfmark } bind def
/EMC { mark /EMC pdfmark } bind def
/cairo_store_point { /cairo_point_y exch def /cairo_point_x exch def } def
/Tj { show currentpoint cairo_store_point } bind def
/TJ {
  {
    dup
    type /stringtype eq
    { show } { -0.001 mul 0 cairo_font_matrix dtransform rmoveto } ifelse
  } forall
  currentpoint cairo_store_point
} bind def
/cairo_selectfont { cairo_font_matrix aload pop pop pop 0 0 6 array astore
    cairo_font exch selectfont cairo_point_x cairo_point_y moveto } bind def
/Tf { pop /cairo_font exch def /cairo_font_matrix where
      { pop cairo_selectfont } if } bind def
/Td { matrix translate cairo_font_matrix matrix concatmatrix dup
      /cairo_font_matrix exch def dup 4 get exch 5 get cairo_store_point
      /cairo_font where { pop cairo_selectfont } if } bind def
/Tm { 2 copy 8 2 roll 6 array astore /cairo_font_matrix exch def
      cairo_store_point /cairo_font where { pop cairo_selectfont } if } bind def
/g { setgray } bind def
/rg { setrgbcolor } bind def
/d1 { setcachedevice } bind def
/cairo_data_source {
  CairoDataIndex CairoData length lt
    { CairoData CairoDataIndex get /CairoDataIndex CairoDataIndex 1 add def }
    { () } ifelse
} def
/cairo_flush_ascii85_file { cairo_ascii85_file status { cairo_ascii85_file flushfile } if } def
/cairo_image { image cairo_flush_ascii85_file } def
/cairo_imagemask { imagemask cairo_flush_ascii85_file } def
%%EndProlog
%%BeginSetup
%%EndSetup
%%Page: 1 1
%%BeginPageSetup
%%PageBoundingBox: 0 0 384 384
%%EndPageSetup
q 0 0 384 384 rectclip
1 0 0 -1 0 384 cm q
0.94902 0.294118 0.235294 rg
339.762 107.867 m 335.367 103.473 335.367 96.352 339.762 91.957 c 358.199
 73.523 l 362.578 69.168 362.617 62.035 358.199 57.613 c 326.383 25.797 
l 322.012 21.453 314.93 21.355 310.473 25.789 c 292.082 44.18 l 287.688 
48.57 280.566 48.57 276.176 44.18 c 271.781 39.785 271.781 32.652 276.176
 28.27 c 294.566 9.891 l 307.652 -3.246 329.051 -3.348 342.289 9.891 c 374.105
 41.707 l 387.328 54.93 387.266 76.281 374.105 89.441 c 355.672 107.863 
l 351.277 112.262 344.156 112.262 339.762 107.867 c h
339.762 107.867 m f
1 0.454902 0.34902 rg
41.711 374.113 m 9.895 342.297 l -3.328 329.07 -3.266 307.719 9.895 294.559
 c 28.328 276.137 l 32.723 271.742 39.844 271.742 44.238 276.137 c 48.633
 280.531 48.633 287.652 44.238 292.043 c 25.801 310.48 l 21.422 314.836 
21.383 321.969 25.801 326.387 c 57.617 358.203 l 61.988 362.551 69.07 362.648
 73.527 358.215 c 91.918 339.824 l 96.312 335.43 103.434 335.43 107.824 
339.824 c 112.219 344.219 112.219 351.348 107.824 355.734 c 89.434 374.113
 l 76.297 387.297 54.895 387.293 41.711 374.113 c h
41.711 374.113 m f
0.301961 0.368627 0.501961 rg
192 0 m 139.188 0 91.375 22.156 56.766 56.766 c 22.156 91.375 0 139.188
 0 192 c 0 297.625 86.375 384 192 384 c 244.812 384 292.625 361.844 327.234
 327.234 c 361.844 292.621 384 244.812 384 192 c 384 86.375 297.625 0 192
 0 c h
192 0 m f
0.239216 0.270588 0.4 rg
192 0 m 139.188 0 91.375 22.156 56.766 56.766 c 327.234 327.234 l 361.844
 292.625 384 244.812 384 192 c 384 86.375 297.625 0 192 0 c h
192 0 m f
1 0.74902 0.25098 rg
192 22.5 m 145.473 22.5 103.285 42.176 72.73 72.73 c 42.176 103.285 22.5
 145.473 22.5 192 c 22.5 285.055 98.945 361.5 192 361.5 c 238.527 361.5 
280.715 341.824 311.27 311.27 c 341.824 280.715 361.5 238.527 361.5 192 
c 361.5 98.945 285.055 22.5 192 22.5 c h
192 22.5 m f
1 0.6 0.2 rg
192 22.5 m 145.473 22.5 103.285 42.176 72.73 72.73 c 311.27 311.27 l 341.824
 280.715 361.5 238.527 361.5 192 c 361.5 98.945 285.055 22.5 192 22.5 c 
h
192 22.5 m f
0.596078 0.85098 0.341176 rg
173.039 45.738 m 167.414 40.137 160.426 36.18 152.777 34.18 c 150.777 26.535
 146.824 18.375 141.199 12.785 c 123.262 -5.227 90.371 -4.625 73.656 17.254
 c 58.32 13.004 41.445 18.262 29.84 29.84 c 18.238 41.445 13.383 58.309 
17.645 73.656 c -3.801 89.891 -6.18 121.883 13.16 141.199 c 18.766 146.812
 26.523 150.777 34.191 152.777 c 36.191 160.426 40.148 167.414 45.75 173.027
 c 56.855 184.129 73.488 189.598 91.605 183.523 c 93.672 159.004 104.398
 137.066 120.734 120.734 c 137 104.465 158.832 93.762 183.234 91.633 c 188.617
 75.621 185.215 57.934 173.039 45.738 c h
173.039 45.738 m f
0.4 0.74902 0.223529 rg
173.039 45.738 m 167.414 40.137 160.426 36.18 152.777 34.18 c 150.777 26.535
 146.824 18.375 141.199 12.785 c 123.262 -5.227 90.371 -4.625 73.656 17.254
 c 58.32 13.004 41.445 18.262 29.84 29.84 c 120.734 120.734 l 137 104.465
 158.832 93.758 183.234 91.633 c 188.617 75.621 185.215 57.934 173.039 45.738
 c h
173.039 45.738 m f
1 0.882353 0.298039 rg
225.75 203.25 m 192 203.25 l 185.781 203.25 180.75 208.281 180.75 214.5
 c 180.75 282 l 180.75 288.219 185.781 293.25 192 293.25 c 259.5 293.25 
l 265.719 293.25 270.75 288.219 270.75 282 c 270.75 235.879 l h
225.75 203.25 m f
1 0.74902 0.25098 rg
225.75 203.25 m 203.25 203.25 l 270.75 270.75 l 270.75 235.879 l h
225.75 203.25 m f
0.596078 0.85098 0.341176 rg
177.453 139.047 m 173.059 134.652 165.941 134.652 161.547 139.047 c 139.047
 161.547 l 134.652 165.941 134.652 173.059 139.047 177.453 c 143.441 181.848
 150.559 181.848 154.953 177.453 c 177.453 154.953 l 181.848 150.559 181.848
 143.441 177.453 139.047 c h
177.453 139.047 m f
0.4 0.74902 0.223529 rg
177.453 139.047 m 173.059 134.652 165.941 134.652 161.547 139.047 c 150.297
 150.297 l 166.203 166.203 l 177.453 154.953 l 181.848 150.559 181.848 143.441
 177.453 139.047 c h
177.453 139.047 m f
251.547 87.453 m 229.047 64.953 l 224.652 60.559 224.652 53.441 229.047
 49.047 c 233.441 44.652 240.559 44.652 244.953 49.047 c 267.453 71.547 
l 271.848 75.941 271.848 83.059 267.453 87.453 c 263.059 91.848 255.941 
91.848 251.547 87.453 c h
251.547 87.453 m f
1 0.454902 0.34902 rg
68.25 214.5 m 68.25 220.715 63.215 225.75 57 225.75 c 50.785 225.75 45.75
 220.715 45.75 214.5 c 45.75 208.285 50.785 203.25 57 203.25 c 63.215 203.25
 68.25 208.285 68.25 214.5 c h
68.25 214.5 m f
158.25 214.5 m 158.25 220.715 153.215 225.75 147 225.75 c 140.785 225.75
 135.75 220.715 135.75 214.5 c 135.75 208.285 140.785 203.25 147 203.25 
c 153.215 203.25 158.25 208.285 158.25 214.5 c h
158.25 214.5 m f
225.75 327 m 225.75 333.215 220.715 338.25 214.5 338.25 c 208.285 338.25
 203.25 333.215 203.25 327 c 203.25 320.785 208.285 315.75 214.5 315.75 
c 220.715 315.75 225.75 320.785 225.75 327 c h
225.75 327 m f
0.701961 0.388235 0.282353 rg
124.5 315.75 m 105.891 315.75 90.75 300.609 90.75 282 c 90.75 263.391 105.891
 248.25 124.5 248.25 c 143.109 248.25 158.25 263.391 158.25 282 c 158.25
 300.609 143.109 315.75 124.5 315.75 c h
124.5 315.75 m f
0.4 0.74902 0.223529 rg
120.75 104.727 m 120.75 61.66 l 120.75 55.441 115.719 50.41 109.5 50.41
 c 103.281 50.41 98.25 55.441 98.25 61.66 c 98.25 82.227 l 77.566 61.66 
l 73.172 57.266 66.051 57.266 61.66 61.66 c 57.266 66.051 57.266 73.172 
61.66 77.566 c 82.234 98.25 l 61.66 98.25 l 55.441 98.25 50.41 103.281 50.41
 109.5 c 50.41 115.719 55.441 120.75 61.66 120.75 c 104.734 120.75 l 112.461
 128.367 l 128.367 112.461 l h
120.75 104.727 m f
0.160784 0.65098 0.0627451 rg
120.75 104.727 m 120.75 61.66 l 120.75 55.441 115.719 50.41 109.5 50.41
 c 103.281 50.41 98.25 55.441 98.25 61.66 c 98.25 82.227 l 77.566 61.66 
l 73.172 57.266 66.051 57.266 61.66 61.66 c 120.414 120.414 l 128.367 112.461
 l h
120.75 104.727 m f
1 0.882353 0.298039 rg
192 79.5 m 162.016 79.5 133.684 91.199 112.457 112.449 c 112.457 112.449
 112.453 112.453 112.453 112.453 c 83.902 140.98 74.078 180.617 82.289 216.984
 c 83.641 223.023 89.668 226.832 95.738 225.477 c 101.805 224.102 105.605
 218.082 104.219 212.016 c 97.672 182.945 105.461 151.246 128.367 128.367
 c 145.164 111.551 167.66 102 192 102 c 198.219 102 203.25 96.969 203.25
 90.75 c 203.25 84.531 198.219 79.5 192 79.5 c h
192 79.5 m f
1 0.74902 0.25098 rg
203.25 90.75 m 203.25 84.531 198.219 79.5 192 79.5 c 162.016 79.5 133.684
 91.199 112.457 112.449 c 112.457 112.449 112.453 112.453 112.453 112.453
 c 128.367 128.367 l 145.164 111.551 167.66 102 192 102 c 198.219 102 203.25
 96.969 203.25 90.75 c h
203.25 90.75 m f
0.301961 0.368627 0.501961 rg
270.75 248.25 m 233.527 248.25 203.25 217.973 203.25 180.75 c 203.25 143.527
 233.527 113.25 270.75 113.25 c 307.973 113.25 338.25 143.527 338.25 180.75
 c 338.25 217.973 307.973 248.25 270.75 248.25 c h
270.75 248.25 m f
0.239216 0.270588 0.4 rg
286.66 180.75 m 289.953 177.453 l 294.348 173.059 294.348 165.941 289.953
 161.547 c 285.559 157.152 278.441 157.152 274.047 161.547 c 270.75 164.84
 l 267.453 161.547 l 263.059 157.152 255.941 157.152 251.547 161.547 c 247.152
 165.941 247.152 173.059 251.547 177.453 c 254.84 180.75 l 251.547 184.047
 l 247.152 188.441 247.152 195.559 251.547 199.953 c 255.941 204.348 263.059
 204.348 267.453 199.953 c 270.75 196.66 l 274.047 199.953 l 278.441 204.348
 285.559 204.348 289.953 199.953 c 294.348 195.559 294.348 188.441 289.953
 184.047 c h
286.66 180.75 m f
Q Q
showpage
%%Trailer
end
%%EOF
