[
  {
    "model": "movies.movie",
    "pk": 1,
    "fields": {
      "title": "The Shawshank Redemption",
      "release_date": "1994-09-22T00:00:00Z",
      "genre": 1,
      "plot": "Two imprisoned men bond over a number of years, finding solace and eventual redemption through acts of common decency."
    }
  },
  {
    "model": "movies.movie",
    "pk": 2,
    "fields": {
      "title": "The Godfather",
      "release_date": "1972-03-24T00:00:00Z",
      "genre": 1,
      "plot": "The aging patriarch of an organized crime dynasty transfers control of his clandestine empire to his reluctant son."
    }
  },
  {
    "model": "movies.movie",
    "pk": 3,
    "fields": {
      "title": "The Dark Knight",
      "release_date": "2008-07-18T00:00:00Z",
      "genre": 2,
      "plot": "When the menace known as the Joker wreaks havoc and chaos on the people of Gotham, Batman must accept one of the greatest psychological and physical tests of his ability to fight injustice."
    }
  },
  {
    "model": "movies.movie",
    "pk":4,
    "fields": {
      "title": "Pulp Fiction",
      "release_date": "1994-10-14T00:00:00Z",
      "genre": 3,
      "plot": "The lives of two mob hitmen, a boxer, a gangster and his wife, and a pair of diner bandits intertwine in four tales of violence and redemption."
    }
  },
  {
    "model": "movies.movie",
    "pk": 5,
    "fields": {
      "title": "Forrest Gump",
      "release_date": "1994-07-06T00:00:00Z",
      "genre": 4,
      "plot": "The presidencies of Kennedy and Johnson, the events of Vietnam, Watergate, and other historical events unfold through the perspective of an Alabama man with an IQ of 75."
    }
  },
  {
    "model": "movies.movie",
    "pk": 6,
    "fields": {
      "title": "The Matrix",
      "release_date": "1999-03-31T00:00:00Z",
      "genre": 2,
      "plot": "A computer hacker learns from mysterious rebels about the true nature of his reality and his role in the war against its controllers."
    }
  },
  {
    "model": "movies.movie",
    "pk": 7,
    "fields": {
      "title": "The Silence of the Lambs",
      "release_date": "1991-02-14T00:00:00Z",
      "genre": 5,
      "plot": "A young F.B.I. cadet must receive the help of an incarcerated and manipulative cannibal killer to help catch another serial killer, a madman who skins his victims."
    }
  },
  {
    "model": "movies.movie",
    "pk": 8,
    "fields": {
      "title": "The Lord of the Rings: The Fellowship of the Ring",
      "release_date": "2001-12-19T00:00:00Z",
      "genre": 6,
      "plot": "A meek Hobbit from the Shire and eight companions set out on a journey to destroy the powerful One Ring and save Middle-earth from the Dark Lord Sauron."
    }
  },
  {
    "model": "movies.movie",
    "pk": 9,
    "fields": {
      "title": "Inception",
      "release_date": "2010-07-16T00:00:00Z",
      "genre": 2,
      "plot": "A thief who steals corporate secrets through the use of dream-sharing technology is given the inverse task of planting an idea into the mind of a C.E.O."
    }
  },
  {
    "model": "movies.movie",
    "pk": 10,
    "fields": {
      "title": "The Lion King",
      "release_date": "1994-06-15T00:00:00Z",
      "genre": 7,
      "plot": "A young lion prince is cast out of his pride by his cruel uncle, who claims he killed his father. While the uncle rules with an iron paw, the prince grows up beyond the Savannah, living by a philosophy: No worries for the rest of your days."
    }
  }
]
