[
    {
        "model": "watchlists.watchlist",
        "pk": 1,
        "fields": {
            "user": 1,
            "movie": 1
        }
    },
    {
        "model": "watchlists.watchlist",
        "pk": 2,
        "fields": {
            "user": 1,
            "movie": 2
        }
    },
    {
        "model": "watchlists.watchlist",
        "pk": 3,
        "fields": {
            "user": 1,
            "movie": 3
        }
    },
    {
        "model": "watchlists.watchlist",
        "pk": 4,
        "fields": {
            "user": 1,
            "movie": 4
        }
    },
    {
        "model": "watchlists.watchlist",
        "pk": 5,
        "fields": {
            "user": 1,
            "movie": 5
        }
    }
]
