NOTA 2,65



==================================
1.
5.0
BUEN TRABAJO!!
==================================

2.

0
- No se encuentra el punto


==================================
3.
----------------------------------
p1

4,5
- Recuerda que en el Execution es preferible no definir funciones fuera de Main
- Se debe generalizar para pasar la función (lamda)
----------------------------------
p2

4
- El execution no tiene la estructura que se maneja en el curso
==================================
4.
5
- BUEN TRABAJO!!