<?xml version="1.0" standalone="no"?>
<!DOCTYPE svg PUBLIC "-//W3C//DTD SVG 1.1//EN" "http://www.w3.org/Graphics/SVG/1.1/DTD/svg11.dtd" >
<svg xmlns="http://www.w3.org/2000/svg">
<metadata>Generated by IcoMoon</metadata>
<defs>
<font id="icomoon" horiz-adv-x="1024">
<font-face units-per-em="1024" ascent="960" descent="-64" />
<missing-glyph horiz-adv-x="1024" />
<glyph unicode="&#x20;" horiz-adv-x="512" d="" />
<glyph unicode="&#xe900;" glyph-name="logo-ale" d="M96.256 448.341l230.229 295.765 305.835 54.955 240.64-237.227-10.24 302.592c0 0-370.347-48.981-591.36-78.336-94.037-12.459-161.109-21.333-161.109-21.333l-13.995-316.416zM202.752 555.008c0 0-53.419-73.899-88.064-121.856-16.555-22.869-28.843-39.765-28.843-39.765l-85.845-226.987 144.384-137.557 728.576 13.824 137.387 189.099-137.387 299.179-51.541 58.539v-312.832l-622.080-20.651 3.413 299.008zM216.576 496.469c0 0 0.853-52.565 1.707-106.667 0.853-57.515 1.877-116.907 1.877-116.907l584.192 24.064v196.096c0 0-63.829 32.939-134.485 28.331-68.437-4.437-143.872-73.045-143.872-73.045s-38.4 38.571-97.109 47.616c-89.6 13.995-212.309 0.512-212.309 0.512zM333.312 730.283l-116.907-154.795v-61.952h182.101c0 0-87.552 178.347 59.221 201.216 6.485 1.024 56.32-10.411 40.448-36.181-35.499-57.344-4.779-105.472 37.717-99.669 41.301 5.632 59.392 45.568 30.891 89.429-23.040 35.669 8.704 80.213 54.955 48.128 135.509-94.037 34.304-185.685 34.304-185.685s47.957 2.389 89.429-3.413c31.061-4.267 54.955-24.064 54.955-24.064l3.413 103.083-174.933 179.029-295.595-55.125z" />
</font></defs></svg>