[{
    "rut": "87654321-0",
    "nombre": "Ana",
    "apellido": "García",
    "email": "ana.garcia@example.com",
    "fono": "+56987654321",
    "nrodocumento": "XYZ987654"
  }
,
  {
    "rut": "1-9",
    "nombre": "Alejo1",
    "apellido": "San1",
    "email": "alejandro.sandoval@ugm.cl",
    "fono": "+56987654321",
    "nrodocumento": "XYZ987612",
  }]