{
    "transactionId": "cd8dfa54-ef2b-4345-83f3-7d2d6ec80999",
    "status": "completed",
    "exclusionaryConditions": {
        "NotAvailable": false,
        "ErrorsPresent": false
    },
    "platinum360": {
        "getInformePlatinum360Response": {
            "response": {
                "Credit": {
                    "Bank": {
                        "TotalBank": 0,
                        "BanksActive": []
                    },
                    "ConsultRUT": {
                        "InquiriesNumber": 11,
                        "DetailConsultRUT": {
                            "DetailConsultRUTType": [
                                {
                                    "InquiryDate": "20231114",
                                    "InquiryCompanyName": "ADMINISTRADORA PLAZA S A",
                                    "InquiryReportName": "INF COMPLEMENT MOR SIN SCORE"
                                },
                                {
                                    "InquiryDate": "20231114",
                                    "InquiryCompanyName": "ADMINISTRADORA PLAZA S A",
                                    "InquiryReportName": "INF COMPLEMENT MOR SIN SCORE"
                                },
                                {
                                    "InquiryDate": "20231114",
                                    "InquiryCompanyName": "ADMINISTRADORA PLAZA S A",
                                    "InquiryReportName": "INF COMPLEMENT MOR SIN SCORE"
                                },
                                {
                                    "InquiryDate": "20231114",
                                    "InquiryCompanyName": "ADMINISTRADORA PLAZA S A",
                                    "InquiryReportName": "INF COMPLEMENT MOR SIN SCORE"
                                },
                                {
                                    "InquiryDate": "20230524",
                                    "InquiryCompanyName": "TRANSBANK SA",
                                    "InquiryReportName": "INF COMPLEMENT MOR SIN SCORE"
                                },
                                {
                                    "InquiryDate": "20230524",
                                    "InquiryCompanyName": "TRANSBANK SA",
                                    "InquiryReportName": "INFORME PLATINUM 360"
                                },
                                {
                                    "InquiryDate": "20230328",
                                    "InquiryCompanyName": "GENERAL MOTORS FINANCIAL CHILE SA",
                                    "InquiryReportName": "INF COMPLEMENT MOR SIN SCORE"
                                },
                                {
                                    "InquiryDate": "20230323",
                                    "InquiryCompanyName": "SERVICIOS FINANCIEROS CONCRECES S A",
                                    "InquiryReportName": "INF COMPLEMENT MOR SIN SCORE"
                                },
                                {
                                    "InquiryDate": "20230328",
                                    "InquiryCompanyName": "GENERAL MOTORS FINANCIAL CHILE SA",
                                    "InquiryReportName": "INF COMPLEMENT MOR SIN SCORE"
                                },
                                {
                                    "InquiryDate": "20230323",
                                    "InquiryCompanyName": "SERVICIOS FINANCIEROS CONCRECES S A",
                                    "InquiryReportName": "INF COMPLEMENT MOR SIN SCORE"
                                },
                                {
                                    "InquiryDate": "20230316",
                                    "InquiryCompanyName": "INVERSIONES SEPTIMA REGION LIMITADA",
                                    "InquiryReportName": "INF COMPLEMENT MOR SIN SCORE"
                                },
                                {
                                    "InquiryDate": "20230315",
                                    "InquiryCompanyName": "GTD TELEDUCTOS S A",
                                    "InquiryReportName": "INF COMPLEMENT MOR SIN SCORE"
                                },
                                {
                                    "InquiryDate": "20230309",
                                    "InquiryCompanyName": "PRIVILEGE SOCIEDAD ANONIMA",
                                    "InquiryReportName": "INF COMPLEMENT MOR SIN SCORE"
                                }
                            ]
                        },
                        "TimelapseNumber": 6,
                        "TimelapseTypeUsed": "MESES"
                    },
                    "CreditRisk": {
                        "PredictorScale": {
                            "MaximumRate": 607,
                            "MinimumRate": 460
                        },
                        "ImportantAspect": [],
                        "PersonsRate": 607,
                        "Everclean": "0",
                        "HistoricalRate": {
                            "HistoricalRateType": [
                                {
                                    "Rate": 607,
                                    "Period": 202312
                                },
                                {
                                    "Rate": 460,
                                    "Period": 202311
                                },
                                {
                                    "Period": 202310
                                },
                                {
                                    "Rate": 460,
                                    "Period": 202309
                                },
                                {
                                    "Period": 202308
                                },
                                {
                                    "Rate": 460,
                                    "Period": 202307
                                },
                                {
                                    "Period": 202306
                                },
                                {
                                    "Rate": 460,
                                    "Period": 202305
                                },
                                {
                                    "Period": 202304
                                },
                                {
                                    "Rate": 460,
                                    "Period": 202303
                                },
                                {
                                    "Period": 202302
                                },
                                {
                                    "Rate": 460,
                                    "Period": 202301
                                },
                                {
                                    "Period": 202212
                                },
                                {
                                    "Rate": 460,
                                    "Period": 202211
                                },
                                {
                                    "Period": 202210
                                },
                                {
                                    "Rate": 460,
                                    "Period": 202209
                                },
                                {
                                    "Period": 202208
                                },
                                {
                                    "Rate": 460,
                                    "Period": 202207
                                },
                                {
                                    "Period": 202206
                                },
                                {
                                    "Rate": 460,
                                    "Period": 202205
                                },
                                {
                                    "Period": 202204
                                },
                                {
                                    "Rate": 460,
                                    "Period": 202203
                                },
                                {
                                    "Rate": 460,
                                    "Period": 202202
                                },
                                {
                                    "Period": 202201
                                }
                            ]
                        },
                        "lessPercentage": ""
                    },
                    "DebtsSummary": {
                        "UnpaidTotalAmount": 78941,
                        "TotalDocsAccumulated12Months": 0,
                        "TotalDocsAccumulatedMoreThan24Months": 0,
                        "BOLAB": {
                            "BOLABType": [],
                            "bolabtype": []
                        },
                        "DelinquencyNumber": 0,
                        "ProtestSummary": {
                            "ExpirationDateLastProtest": "0",
                            "TotalProtests": 0,
                            "AmountLastProtest": "0",
                            "TotalAmountProtests": 0
                        },
                        "TotalMultaeInfraccionLaboralPrevisional": 0,
                        "UnpaidProtestDebtsThousandPesos": 0,
                        "TotalDocsFrom6To12Months": 0,
                        "UnpaidNumberInformed": 0,
                        "DocsAmountAccumulated6Months": 78941,
                        "TotalDocsICOM": 1,
                        "DocsAmountAccumulated12Months": 0,
                        "UnpaidLastAmount": 78941,
                        "TotalDocsLast6Months": 1,
                        "DebtsSummaryDetail": {
                            "TotalAmountDebts": 78941,
                            "TotalDebts": 1
                        },
                        "ICOM": {
                            "ICOMType": [
                                {
                                    "expirationDate": "20191205",
                                    "documentType": "TC",
                                    "moneyCode": "$",
                                    "unpaidAmount": "78941",
                                    "reasonType": "MCC",
                                    "libradorName": "TARJETA ABCVISA",
                                    "localidadName": "ESTACION CENTRAL",
                                    "debtType": "D",
                                    "chequeOperatioNumber": "2000",
                                    "creditType": "ICOM",
                                    "marketCode": "",
                                    "marketDescription": ""
                                }
                            ],
                            "icomtype": [
                                {
                                    "expirationDate": "20191205",
                                    "documentType": "TC",
                                    "moneyCode": "$",
                                    "unpaidAmount": "78941",
                                    "reasonType": "MCC",
                                    "libradorName": "TARJETA ABCVISA",
                                    "localidadName": "ESTACION CENTRAL",
                                    "debtType": "D",
                                    "chequeOperatioNumber": "2000",
                                    "creditType": "ICOM",
                                    "marketCode": "",
                                    "marketDescription": ""
                                }
                            ]
                        },
                        "UnpaidLastExpirationDate": "20191205",
                        "ConectionAICSSErrorIndicator": "S",
                        "UnpaidLastDebtType": "TC",
                        "TotalDocsFrom12To24Months": 0,
                        "TotalDocsBoletinProtestosEImpagos": 0,
                        "BED": {
                            "BEDType": [],
                            "bedtype": []
                        },
                        "AmountAccumulated6Months": 78941,
                        "DocsAmountAccumulatedMoreThan24Months": 0,
                        "UnpaidAmountPesos": 0,
                        "DocsAmountAccumulated24Months": 78941,
                        "AccessCamaraComercio": "SI",
                        "DocsAmountLast6Months": 78941,
                        "TotalDocsMoreThan24Months": 0,
                        "DocsAmountFrom6To12Months": 0,
                        "DocsAmountFrom12To24Months": 0,
                        "SumaryBOLAB": {
                            "TotalBolab": 0,
                            "TotalAmountBolab": 0,
                            "AmountLastBolab": "0"
                        },
                        "DocsAmountMoreThan24Months": 0,
                        "TotalDocsAccumulated24Months": 1,
                        "BOLCOM": {
                            "BOLCOMType": [],
                            "bolcomtype": []
                        },
                        "UnpaidTotalNumber": 1,
                        "LastDateBoletinLaboral": "00000000"
                    },
                    "BoletinConcursal": {
                        "DetailBoletinConcursal": "0",
                        "SumaryBolConcursal": {
                            "PublicationNumberBolConcursal": "0"
                        }
                    },
                    "SBIF": {
                        "SBIFSummary": {
                            "TotalDebts": "",
                            "DetailsCount": 0,
                            "PresenceOfDetails": "N",
                            "LatestFinancialDebt": ""
                        },
                        "SBIFDetail": []
                    }
                },
                "Capacity": {
                    "Salary": {
                        "RentaFuncionarioPublico": "",
                        "RentaPresunta": "",
                        "DescCurrecy": "PESOS"
                    },
                    "CurrentEmploymentInformation": {
                        "CompanyData": {
                            "LaboralTelephone": "",
                            "VerificationDate": "00000000",
                            "CommunesEmployerAddress": "",
                            "Employer": "",
                            "VerificationSource": "",
                            "CityEmployerAddress": "",
                            "AddressOfTheEmployer": "",
                            "ActualizationDate": "00000000"
                        },
                        "Activity": {
                            "ActivityOfTheEmployer": ""
                        }
                    },
                    "EmploymentInfo": {
                        "ProfessionDescription": "PROFESOR",
                        "RoleDescription": "",
                        "ProfessionCode": 10
                    }
                },
                "Behavior": {
                    "Family": {
                        "MaritalStatus": "S",
                        "DateOfMarriage": "19781222",
                        "AdultChildrenCount": "0",
                        "MinorChildrenCount": "0",
                        "MaritalStatusDescription": "DIVORCIADO",
                        "SpouseRut": ""
                    },
                    "Identification": {
                        "DateOfBirth": "19510818",
                        "FlagIdentityVerification": "SI",
                        "NationalityType": "CHILENO",
                        "InterdictFlag": "N",
                        "GenderDescription": "FEMENINO",
                        "FlagDeath": 0,
                        "MotherSurname": "ORTEGA",
                        "Gender": "F",
                        "DeathDate": "00000000",
                        "Nationality": "C",
                        "Name": "NORA DE LAS MERCEDES VALENZUELA ORTEGA",
                        "OtherInfo": {
                            "IsFonasa": "1",
                            "PensionSolidaria": "0",
                            "CodIse": "C1B",
                            "DateUpdateIse": "20230930"
                        },
                        "Rut": "0065592770",
                        "NameFull": "NORA DE LAS MERCEDES VALENZUELA ORTEGA",
                        "FlagDeathDescription": "NO",
                        "FatherSurname": "VALENZUELA",
                        "InterdictDate": "00000000",
                        "Age": 72
                    },
                    "Contactability": {
                        "Addresses": {
                            "AddressesType": [
                                {
                                    "AddressDate": "20040102",
                                    "PostalCode": "",
                                    "AditionalInfo": "72",
                                    "Communes": "ESTACION CENTRAL",
                                    "City": "SANTIAGO",
                                    "Number": "547",
                                    "LastAddressVerificationDate": "0",
                                    "Region": "METROPOLITANA DE SANTIAGO",
                                    "Street": "AVDA GENERAL VELASQUEZ",
                                    "AddressType": "PARTICULAR",
                                    "CodeRegion": "RM",
                                    "SourceOfAddress": "DICOM VERIFICACION DE DOMICILIO",
                                    "StreetAndNumber": "AVDA GENERAL VELASQUEZ 547"
                                }
                            ]
                        },
                        "AddressCount": 3,
                        "Telephones": {
                            "TelephonesType": [
                                {
                                    "Telephone": 88271489,
                                    "SourceOfTelephone": "ACTUALIA",
                                    "TelephoneDate": "20180831"
                                },
                                {
                                    "Telephone": 79074689,
                                    "SourceOfTelephone": "TACTICA",
                                    "TelephoneDate": "20110321"
                                },
                                {
                                    "Telephone": 91789689,
                                    "SourceOfTelephone": "MAPCITY",
                                    "TelephoneDate": "20080201"
                                },
                                {
                                    "Telephone": 24915376,
                                    "SourceOfTelephone": "METODOS URBANOS INDIRECTOS",
                                    "TelephoneDate": "20041201"
                                },
                                {
                                    "Telephone": 27794068,
                                    "SourceOfTelephone": "BLANCAS",
                                    "TelephoneDate": "20020315"
                                }
                            ]
                        },
                        "TelephoneCount": 5
                    },
                    "Other": {
                        "Email": "norval18@hotmail.com",
                        "EmailDate": "20200414",
                        "WebSiteURL": "",
                        "SourceOfEmail": "INNOVAWEB"
                    },
                    "SRCeI": {
                        "DocumentStatus": "N",
                        "SerialNumberIndicator": "2",
                        "DocumentStatusReason": "DOCUMENTO NO EMITIDO",
                        "DocumentStatusTimestamp": "00000000",
                        "InquiredSerialID": "526279355",
                        "ReturnedSerialID": "526279355",
                        "CodeExecution": "00",
                        "BlockedStatusFlag": "N",
                        "BlockedCardLess30Days": ""
                    }
                },
                "Guarantees": {
                    "Accreditations": {
                        "Sii": {
                            "DateUpdateInfoUltimoTimbraje": "20101231",
                            "InicioActividades": "0",
                            "UltimoTimbraje": "20101231",
                            "DateUpdateInfoInicioAct": "",
                            "StartSIIDate": "0",
                            "LastTaxPeriodNumber": "",
                            "ObservacionesTributarias": "00,00,00,00,00,00,00,00",
                            "ObservacionesTributariasNumber": 5,
                            "LastTaxPeriod": "",
                            "Rubro": "",
                            "CategorySII": "",
                            "EconomicActivityDescription": "SUMINISTRO INDUSTRIAL DE COMIDAS POR ENCARGO CONCESION DE SERVICIOS DE ALIMENTACION",
                            "EconomicActivityCode": ""
                        },
                        "AccreditationsFlag": "SI",
                        "PartnersAndCompanies": {
                            "CountRelationshipsSociety": "",
                            "Societies": []
                        },
                        "RealEstate": {
                            "TotalAssesmentAmountPesos": 142979745,
                            "PropertiesCount": 1
                        },
                        "Gse": {
                            "GseDate": "00000000",
                            "GseCode": "D",
                            "GseSource": ""
                        },
                        "Vehicles": {
                            "TotalNumberCars": 0,
                            "ComercialValuationCar": "0",
                            "CarTaxValuation": "0",
                            "TotalNumberOtherCars": 0,
                            "TotalNumberHeavyCars": 0,
                            "TotalNumberLightCars": 0
                        }
                    }
                }
            }
        }
    },
    "returnedProducts": [
        "platinum360"
    ],
    "originalTransactionId": "cd8dfa54-ef2b-4345-83f3-7d2d6ec80999"
}