%YAML 1.1
%TAG !u! tag:unity3d.com,2011:
--- !u!1 &7169144159544499096
GameObject:
  m_ObjectHideFlags: 0
  m_CorrespondingSourceObject: {fileID: 0}
  m_PrefabInstance: {fileID: 0}
  m_PrefabAsset: {fileID: 0}
  serializedVersion: 6
  m_Component:
  - component: {fileID: 7169144159544499103}
  m_Layer: 0
  m_Name: LookAt
  m_TagString: Untagged
  m_Icon: {fileID: 0}
  m_NavMeshLayer: 0
  m_StaticEditorFlags: 0
  m_IsActive: 1
--- !u!4 &7169144159544499103
Transform:
  m_ObjectHideFlags: 0
  m_CorrespondingSourceObject: {fileID: 0}
  m_PrefabInstance: {fileID: 0}
  m_PrefabAsset: {fileID: 0}
  m_GameObject: {fileID: 7169144159544499096}
  m_LocalRotation: {x: -0, y: -0, z: -0, w: 1}
  m_LocalPosition: {x: 0, y: -1.55, z: 0.74}
  m_LocalScale: {x: 1, y: 1, z: 1}
  m_ConstrainProportionsScale: 0
  m_Children: []
  m_Father: {fileID: 7169144160663928930}
  m_RootOrder: 0
  m_LocalEulerAnglesHint: {x: 0, y: 0, z: 0}
--- !u!1 &7169144160663928931
GameObject:
  m_ObjectHideFlags: 0
  m_CorrespondingSourceObject: {fileID: 0}
  m_PrefabInstance: {fileID: 0}
  m_PrefabAsset: {fileID: 0}
  serializedVersion: 6
  m_Component:
  - component: {fileID: 7169144160663928930}
  m_Layer: 0
  m_Name: Character Prefab
  m_TagString: Untagged
  m_Icon: {fileID: 0}
  m_NavMeshLayer: 0
  m_StaticEditorFlags: 0
  m_IsActive: 1
--- !u!4 &7169144160663928930
Transform:
  m_ObjectHideFlags: 0
  m_CorrespondingSourceObject: {fileID: 0}
  m_PrefabInstance: {fileID: 0}
  m_PrefabAsset: {fileID: 0}
  m_GameObject: {fileID: 7169144160663928931}
  m_LocalRotation: {x: 0, y: 0, z: 0, w: 1}
  m_LocalPosition: {x: 0, y: 3.16, z: 0}
  m_LocalScale: {x: 1, y: 1, z: 1}
  m_ConstrainProportionsScale: 0
  m_Children:
  - {fileID: 7169144159544499103}
  - {fileID: 7275375928187134616}
  m_Father: {fileID: 0}
  m_RootOrder: 0
  m_LocalEulerAnglesHint: {x: 0, y: 0, z: 0}
--- !u!1001 &3704239482486060447
PrefabInstance:
  m_ObjectHideFlags: 0
  serializedVersion: 2
  m_Modification:
    m_TransformParent: {fileID: 7169144160663928930}
    m_Modifications:
    - target: {fileID: 5770782997729285769, guid: 55cdc8dcaceb82e49bcf7ba44be8e478, type: 3}
      propertyPath: m_Camera
      value: 
      objectReference: {fileID: 0}
    - target: {fileID: 5770782997729285775, guid: 55cdc8dcaceb82e49bcf7ba44be8e478, type: 3}
      propertyPath: cameraTransform
      value: 
      objectReference: {fileID: 0}
    - target: {fileID: 5770782997729285775, guid: 55cdc8dcaceb82e49bcf7ba44be8e478, type: 3}
      propertyPath: cinemachineCamera
      value: 
      objectReference: {fileID: 0}
    - target: {fileID: 6313846510010980103, guid: 55cdc8dcaceb82e49bcf7ba44be8e478, type: 3}
      propertyPath: m_RootOrder
      value: 1
      objectReference: {fileID: 0}
    - target: {fileID: 6313846510010980103, guid: 55cdc8dcaceb82e49bcf7ba44be8e478, type: 3}
      propertyPath: m_LocalPosition.x
      value: 0
      objectReference: {fileID: 0}
    - target: {fileID: 6313846510010980103, guid: 55cdc8dcaceb82e49bcf7ba44be8e478, type: 3}
      propertyPath: m_LocalPosition.y
      value: -1.42
      objectReference: {fileID: 0}
    - target: {fileID: 6313846510010980103, guid: 55cdc8dcaceb82e49bcf7ba44be8e478, type: 3}
      propertyPath: m_LocalPosition.z
      value: -0.42
      objectReference: {fileID: 0}
    - target: {fileID: 6313846510010980103, guid: 55cdc8dcaceb82e49bcf7ba44be8e478, type: 3}
      propertyPath: m_LocalRotation.w
      value: 1
      objectReference: {fileID: 0}
    - target: {fileID: 6313846510010980103, guid: 55cdc8dcaceb82e49bcf7ba44be8e478, type: 3}
      propertyPath: m_LocalRotation.x
      value: -0
      objectReference: {fileID: 0}
    - target: {fileID: 6313846510010980103, guid: 55cdc8dcaceb82e49bcf7ba44be8e478, type: 3}
      propertyPath: m_LocalRotation.y
      value: -0
      objectReference: {fileID: 0}
    - target: {fileID: 6313846510010980103, guid: 55cdc8dcaceb82e49bcf7ba44be8e478, type: 3}
      propertyPath: m_LocalRotation.z
      value: -0
      objectReference: {fileID: 0}
    - target: {fileID: 6313846510010980103, guid: 55cdc8dcaceb82e49bcf7ba44be8e478, type: 3}
      propertyPath: m_LocalEulerAnglesHint.x
      value: 0
      objectReference: {fileID: 0}
    - target: {fileID: 6313846510010980103, guid: 55cdc8dcaceb82e49bcf7ba44be8e478, type: 3}
      propertyPath: m_LocalEulerAnglesHint.y
      value: 0
      objectReference: {fileID: 0}
    - target: {fileID: 6313846510010980103, guid: 55cdc8dcaceb82e49bcf7ba44be8e478, type: 3}
      propertyPath: m_LocalEulerAnglesHint.z
      value: 0
      objectReference: {fileID: 0}
    - target: {fileID: 6689139976652393917, guid: 55cdc8dcaceb82e49bcf7ba44be8e478, type: 3}
      propertyPath: m_Name
      value: Character GameObject
      objectReference: {fileID: 0}
    m_RemovedComponents: []
  m_SourcePrefab: {fileID: 100100000, guid: 55cdc8dcaceb82e49bcf7ba44be8e478, type: 3}
--- !u!4 &7275375928187134616 stripped
Transform:
  m_CorrespondingSourceObject: {fileID: 6313846510010980103, guid: 55cdc8dcaceb82e49bcf7ba44be8e478, type: 3}
  m_PrefabInstance: {fileID: 3704239482486060447}
  m_PrefabAsset: {fileID: 0}
