%YAML 1.1
%TAG !u! tag:unity3d.com,2011:
--- !u!1 &6989503730006661931
GameObject:
  m_ObjectHideFlags: 0
  m_CorrespondingSourceObject: {fileID: 0}
  m_PrefabInstance: {fileID: 0}
  m_PrefabAsset: {fileID: 0}
  serializedVersion: 6
  m_Component:
  - component: {fileID: 6989503730006661925}
  - component: {fileID: 6989503730006661930}
  m_Layer: 0
  m_Name: GameManager
  m_TagString: Untagged
  m_Icon: {fileID: 0}
  m_NavMeshLayer: 0
  m_StaticEditorFlags: 0
  m_IsActive: 1
--- !u!4 &6989503730006661925
Transform:
  m_ObjectHideFlags: 0
  m_CorrespondingSourceObject: {fileID: 0}
  m_PrefabInstance: {fileID: 0}
  m_PrefabAsset: {fileID: 0}
  m_GameObject: {fileID: 6989503730006661931}
  m_LocalRotation: {x: 0, y: 0, z: 0, w: 1}
  m_LocalPosition: {x: 0.3742361, y: 3.010529, z: -0.002233793}
  m_LocalScale: {x: 1, y: 1, z: 1}
  m_ConstrainProportionsScale: 0
  m_Children: []
  m_Father: {fileID: 0}
  m_RootOrder: 0
  m_LocalEulerAnglesHint: {x: 0, y: 0, z: 0}
--- !u!114 &6989503730006661930
MonoBehaviour:
  m_ObjectHideFlags: 0
  m_CorrespondingSourceObject: {fileID: 0}
  m_PrefabInstance: {fileID: 0}
  m_PrefabAsset: {fileID: 0}
  m_GameObject: {fileID: 6989503730006661931}
  m_Enabled: 1
  m_EditorHideFlags: 0
  m_Script: {fileID: 11500000, guid: ce48f5a629fa9684abe7f59ddcfc8668, type: 3}
  m_Name: 
  m_EditorClassIdentifier: 
  Instance: {fileID: 6989503730006661930}
  Fireball: {fileID: 6134018447686821516, guid: 832a59fcb7b1b604187cb0491ad386e4, type: 3}
  Mushroom: {fileID: 3645757406819333419, guid: 079a321ac640f9f41a69723f8159088d, type: 3}
  SpawnPositionX: 10
  GameMode: FirstGameModeScene
  MaxTimeBetweenMushroomSpawn: 10
  MaxTimeBetweenFireballSpawn: 2
  Timer: 60
  isCoolDownGegantina: 0
