%YAML 1.1
%TAG !u! tag:unity3d.com,2011:
--- !u!74 &7400000
AnimationClip:
  m_ObjectHideFlags: 0
  m_CorrespondingSourceObject: {fileID: 0}
  m_PrefabInstance: {fileID: 0}
  m_PrefabAsset: {fileID: 0}
  m_Name: Movement
  serializedVersion: 6
  m_Legacy: 0
  m_Compressed: 0
  m_UseHighQualityCurve: 1
  m_RotationCurves: []
  m_CompressedRotationCurves: []
  m_EulerCurves: []
  m_PositionCurves: []
  m_ScaleCurves: []
  m_FloatCurves: []
  m_PPtrCurves:
  - curve:
    - time: 0
      value: {fileID: 1334575731, guid: 72cd46fd49a90764097432007720b5d1, type: 3}
    - time: 0.016666668
      value: {fileID: -189476968, guid: 72cd46fd49a90764097432007720b5d1, type: 3}
    - time: 0.033333335
      value: {fileID: 1485497704, guid: 72cd46fd49a90764097432007720b5d1, type: 3}
    - time: 0.05
      value: {fileID: -1869013501, guid: 72cd46fd49a90764097432007720b5d1, type: 3}
    - time: 0.06666667
      value: {fileID: 134224955, guid: 72cd46fd49a90764097432007720b5d1, type: 3}
    - time: 0.083333336
      value: {fileID: -364378551, guid: 72cd46fd49a90764097432007720b5d1, type: 3}
    - time: 0.1
      value: {fileID: -652333921, guid: 72cd46fd49a90764097432007720b5d1, type: 3}
    - time: 0.11666667
      value: {fileID: 1429526558, guid: 72cd46fd49a90764097432007720b5d1, type: 3}
    - time: 0.13333334
      value: {fileID: -52257369, guid: 72cd46fd49a90764097432007720b5d1, type: 3}
    - time: 0.15
      value: {fileID: 1511967767, guid: 72cd46fd49a90764097432007720b5d1, type: 3}
    - time: 0.16666667
      value: {fileID: 1166515835, guid: 72cd46fd49a90764097432007720b5d1, type: 3}
    - time: 0.18333334
      value: {fileID: -933670896, guid: 72cd46fd49a90764097432007720b5d1, type: 3}
    - time: 0.2
      value: {fileID: -1487005662, guid: 72cd46fd49a90764097432007720b5d1, type: 3}
    - time: 0.21666667
      value: {fileID: 1252507515, guid: 72cd46fd49a90764097432007720b5d1, type: 3}
    - time: 0.23333333
      value: {fileID: -1499701218, guid: 72cd46fd49a90764097432007720b5d1, type: 3}
    - time: 0.25
      value: {fileID: 346403220, guid: 72cd46fd49a90764097432007720b5d1, type: 3}
    - time: 0.26666668
      value: {fileID: 1443346462, guid: 72cd46fd49a90764097432007720b5d1, type: 3}
    - time: 0.28333333
      value: {fileID: 1179612371, guid: 72cd46fd49a90764097432007720b5d1, type: 3}
    - time: 0.3
      value: {fileID: -680202634, guid: 72cd46fd49a90764097432007720b5d1, type: 3}
    - time: 0.31666666
      value: {fileID: -1499006382, guid: 72cd46fd49a90764097432007720b5d1, type: 3}
    - time: 0.33333334
      value: {fileID: 1686216123, guid: 72cd46fd49a90764097432007720b5d1, type: 3}
    - time: 0.35
      value: {fileID: -1082576301, guid: 72cd46fd49a90764097432007720b5d1, type: 3}
    - time: 0.36666667
      value: {fileID: 1342733443, guid: 72cd46fd49a90764097432007720b5d1, type: 3}
    - time: 0.38333333
      value: {fileID: -1651271554, guid: 72cd46fd49a90764097432007720b5d1, type: 3}
    - time: 0.4
      value: {fileID: 862487056, guid: 72cd46fd49a90764097432007720b5d1, type: 3}
    - time: 0.41666666
      value: {fileID: -1089638167, guid: 72cd46fd49a90764097432007720b5d1, type: 3}
    - time: 0.43333334
      value: {fileID: -903897453, guid: 72cd46fd49a90764097432007720b5d1, type: 3}
    - time: 0.45
      value: {fileID: 1201622794, guid: 72cd46fd49a90764097432007720b5d1, type: 3}
    - time: 0.46666667
      value: {fileID: 1693586258, guid: 72cd46fd49a90764097432007720b5d1, type: 3}
    - time: 0.48333332
      value: {fileID: 1726837615, guid: 72cd46fd49a90764097432007720b5d1, type: 3}
    - time: 0.5
      value: {fileID: 1302025959, guid: 72cd46fd49a90764097432007720b5d1, type: 3}
    - time: 0.51666665
      value: {fileID: 106834719, guid: 72cd46fd49a90764097432007720b5d1, type: 3}
    - time: 0.53333336
      value: {fileID: 234706121, guid: 72cd46fd49a90764097432007720b5d1, type: 3}
    - time: 0.55
      value: {fileID: -142803896, guid: 72cd46fd49a90764097432007720b5d1, type: 3}
    - time: 0.56666666
      value: {fileID: 70350784, guid: 72cd46fd49a90764097432007720b5d1, type: 3}
    - time: 0.5833333
      value: {fileID: 918460080, guid: 72cd46fd49a90764097432007720b5d1, type: 3}
    - time: 0.6
      value: {fileID: 1130992056, guid: 72cd46fd49a90764097432007720b5d1, type: 3}
    - time: 0.6166667
      value: {fileID: 1748458921, guid: 72cd46fd49a90764097432007720b5d1, type: 3}
    - time: 0.6333333
      value: {fileID: 524503539, guid: 72cd46fd49a90764097432007720b5d1, type: 3}
    - time: 0.65
      value: {fileID: -1263359694, guid: 72cd46fd49a90764097432007720b5d1, type: 3}
    - time: 0.6666667
      value: {fileID: -575721290, guid: 72cd46fd49a90764097432007720b5d1, type: 3}
    - time: 0.68333334
      value: {fileID: 2026245273, guid: 72cd46fd49a90764097432007720b5d1, type: 3}
    - time: 0.7
      value: {fileID: -2103467716, guid: 72cd46fd49a90764097432007720b5d1, type: 3}
    - time: 0.71666664
      value: {fileID: 950225631, guid: 72cd46fd49a90764097432007720b5d1, type: 3}
    - time: 0.73333335
      value: {fileID: -65180463, guid: 72cd46fd49a90764097432007720b5d1, type: 3}
    - time: 0.75
      value: {fileID: 957360776, guid: 72cd46fd49a90764097432007720b5d1, type: 3}
    - time: 0.76666665
      value: {fileID: 418600934, guid: 72cd46fd49a90764097432007720b5d1, type: 3}
    - time: 0.78333336
      value: {fileID: 2135454233, guid: 72cd46fd49a90764097432007720b5d1, type: 3}
    - time: 0.8
      value: {fileID: 187393202, guid: 72cd46fd49a90764097432007720b5d1, type: 3}
    - time: 0.81666666
      value: {fileID: -2270119, guid: 72cd46fd49a90764097432007720b5d1, type: 3}
    - time: 0.8333333
      value: {fileID: -630567401, guid: 72cd46fd49a90764097432007720b5d1, type: 3}
    - time: 0.85
      value: {fileID: -655340715, guid: 72cd46fd49a90764097432007720b5d1, type: 3}
    - time: 0.8666667
      value: {fileID: 111576542, guid: 72cd46fd49a90764097432007720b5d1, type: 3}
    - time: 0.8833333
      value: {fileID: -614518054, guid: 72cd46fd49a90764097432007720b5d1, type: 3}
    - time: 0.9
      value: {fileID: 1232023284, guid: 72cd46fd49a90764097432007720b5d1, type: 3}
    - time: 0.9166667
      value: {fileID: 773171610, guid: 72cd46fd49a90764097432007720b5d1, type: 3}
    - time: 0.93333334
      value: {fileID: -86791900, guid: 72cd46fd49a90764097432007720b5d1, type: 3}
    - time: 0.95
      value: {fileID: -1316758264, guid: 72cd46fd49a90764097432007720b5d1, type: 3}
    - time: 0.96666664
      value: {fileID: 1346879546, guid: 72cd46fd49a90764097432007720b5d1, type: 3}
    - time: 0.98333335
      value: {fileID: 848844129, guid: 72cd46fd49a90764097432007720b5d1, type: 3}
    attribute: m_Sprite
    path: 
    classID: 212
    script: {fileID: 0}
  m_SampleRate: 60
  m_WrapMode: 0
  m_Bounds:
    m_Center: {x: 0, y: 0, z: 0}
    m_Extent: {x: 0, y: 0, z: 0}
  m_ClipBindingConstant:
    genericBindings:
    - serializedVersion: 2
      path: 0
      attribute: 0
      script: {fileID: 0}
      typeID: 212
      customType: 23
      isPPtrCurve: 1
    pptrCurveMapping:
    - {fileID: 1334575731, guid: 72cd46fd49a90764097432007720b5d1, type: 3}
    - {fileID: -189476968, guid: 72cd46fd49a90764097432007720b5d1, type: 3}
    - {fileID: 1485497704, guid: 72cd46fd49a90764097432007720b5d1, type: 3}
    - {fileID: -1869013501, guid: 72cd46fd49a90764097432007720b5d1, type: 3}
    - {fileID: 134224955, guid: 72cd46fd49a90764097432007720b5d1, type: 3}
    - {fileID: -364378551, guid: 72cd46fd49a90764097432007720b5d1, type: 3}
    - {fileID: -652333921, guid: 72cd46fd49a90764097432007720b5d1, type: 3}
    - {fileID: 1429526558, guid: 72cd46fd49a90764097432007720b5d1, type: 3}
    - {fileID: -52257369, guid: 72cd46fd49a90764097432007720b5d1, type: 3}
    - {fileID: 1511967767, guid: 72cd46fd49a90764097432007720b5d1, type: 3}
    - {fileID: 1166515835, guid: 72cd46fd49a90764097432007720b5d1, type: 3}
    - {fileID: -933670896, guid: 72cd46fd49a90764097432007720b5d1, type: 3}
    - {fileID: -1487005662, guid: 72cd46fd49a90764097432007720b5d1, type: 3}
    - {fileID: 1252507515, guid: 72cd46fd49a90764097432007720b5d1, type: 3}
    - {fileID: -1499701218, guid: 72cd46fd49a90764097432007720b5d1, type: 3}
    - {fileID: 346403220, guid: 72cd46fd49a90764097432007720b5d1, type: 3}
    - {fileID: 1443346462, guid: 72cd46fd49a90764097432007720b5d1, type: 3}
    - {fileID: 1179612371, guid: 72cd46fd49a90764097432007720b5d1, type: 3}
    - {fileID: -680202634, guid: 72cd46fd49a90764097432007720b5d1, type: 3}
    - {fileID: -1499006382, guid: 72cd46fd49a90764097432007720b5d1, type: 3}
    - {fileID: 1686216123, guid: 72cd46fd49a90764097432007720b5d1, type: 3}
    - {fileID: -1082576301, guid: 72cd46fd49a90764097432007720b5d1, type: 3}
    - {fileID: 1342733443, guid: 72cd46fd49a90764097432007720b5d1, type: 3}
    - {fileID: -1651271554, guid: 72cd46fd49a90764097432007720b5d1, type: 3}
    - {fileID: 862487056, guid: 72cd46fd49a90764097432007720b5d1, type: 3}
    - {fileID: -1089638167, guid: 72cd46fd49a90764097432007720b5d1, type: 3}
    - {fileID: -903897453, guid: 72cd46fd49a90764097432007720b5d1, type: 3}
    - {fileID: 1201622794, guid: 72cd46fd49a90764097432007720b5d1, type: 3}
    - {fileID: 1693586258, guid: 72cd46fd49a90764097432007720b5d1, type: 3}
    - {fileID: 1726837615, guid: 72cd46fd49a90764097432007720b5d1, type: 3}
    - {fileID: 1302025959, guid: 72cd46fd49a90764097432007720b5d1, type: 3}
    - {fileID: 106834719, guid: 72cd46fd49a90764097432007720b5d1, type: 3}
    - {fileID: 234706121, guid: 72cd46fd49a90764097432007720b5d1, type: 3}
    - {fileID: -142803896, guid: 72cd46fd49a90764097432007720b5d1, type: 3}
    - {fileID: 70350784, guid: 72cd46fd49a90764097432007720b5d1, type: 3}
    - {fileID: 918460080, guid: 72cd46fd49a90764097432007720b5d1, type: 3}
    - {fileID: 1130992056, guid: 72cd46fd49a90764097432007720b5d1, type: 3}
    - {fileID: 1748458921, guid: 72cd46fd49a90764097432007720b5d1, type: 3}
    - {fileID: 524503539, guid: 72cd46fd49a90764097432007720b5d1, type: 3}
    - {fileID: -1263359694, guid: 72cd46fd49a90764097432007720b5d1, type: 3}
    - {fileID: -575721290, guid: 72cd46fd49a90764097432007720b5d1, type: 3}
    - {fileID: 2026245273, guid: 72cd46fd49a90764097432007720b5d1, type: 3}
    - {fileID: -2103467716, guid: 72cd46fd49a90764097432007720b5d1, type: 3}
    - {fileID: 950225631, guid: 72cd46fd49a90764097432007720b5d1, type: 3}
    - {fileID: -65180463, guid: 72cd46fd49a90764097432007720b5d1, type: 3}
    - {fileID: 957360776, guid: 72cd46fd49a90764097432007720b5d1, type: 3}
    - {fileID: 418600934, guid: 72cd46fd49a90764097432007720b5d1, type: 3}
    - {fileID: 2135454233, guid: 72cd46fd49a90764097432007720b5d1, type: 3}
    - {fileID: 187393202, guid: 72cd46fd49a90764097432007720b5d1, type: 3}
    - {fileID: -2270119, guid: 72cd46fd49a90764097432007720b5d1, type: 3}
    - {fileID: -630567401, guid: 72cd46fd49a90764097432007720b5d1, type: 3}
    - {fileID: -655340715, guid: 72cd46fd49a90764097432007720b5d1, type: 3}
    - {fileID: 111576542, guid: 72cd46fd49a90764097432007720b5d1, type: 3}
    - {fileID: -614518054, guid: 72cd46fd49a90764097432007720b5d1, type: 3}
    - {fileID: 1232023284, guid: 72cd46fd49a90764097432007720b5d1, type: 3}
    - {fileID: 773171610, guid: 72cd46fd49a90764097432007720b5d1, type: 3}
    - {fileID: -86791900, guid: 72cd46fd49a90764097432007720b5d1, type: 3}
    - {fileID: -1316758264, guid: 72cd46fd49a90764097432007720b5d1, type: 3}
    - {fileID: 1346879546, guid: 72cd46fd49a90764097432007720b5d1, type: 3}
    - {fileID: 848844129, guid: 72cd46fd49a90764097432007720b5d1, type: 3}
  m_AnimationClipSettings:
    serializedVersion: 2
    m_AdditiveReferencePoseClip: {fileID: 0}
    m_AdditiveReferencePoseTime: 0
    m_StartTime: 0
    m_StopTime: 1
    m_OrientationOffsetY: 0
    m_Level: 0
    m_CycleOffset: 0
    m_HasAdditiveReferencePose: 0
    m_LoopTime: 1
    m_LoopBlend: 0
    m_LoopBlendOrientation: 0
    m_LoopBlendPositionY: 0
    m_LoopBlendPositionXZ: 0
    m_KeepOriginalOrientation: 0
    m_KeepOriginalPositionY: 1
    m_KeepOriginalPositionXZ: 0
    m_HeightFromFeet: 0
    m_Mirror: 0
  m_EditorCurves: []
  m_EulerEditorCurves: []
  m_HasGenericRootTransform: 0
  m_HasMotionFloatCurves: 0
  m_Events: []
