%YAML 1.1
%TAG !u! tag:unity3d.com,2011:
--- !u!1045 &1
EditorBuildSettings:
  m_ObjectHideFlags: 0
  serializedVersion: 2
  m_Scenes:
  - enabled: 1
    path: Assets/Scenes/Menu.unity
    guid: 933b998c0b6667f4cbc970ba3f588e85
  - enabled: 1
    path: Assets/Scenes/Game.unity
    guid: 56d2e89a18711e64087058bf97676dec
  - enabled: 1
    path: Assets/Scenes/Resultats.unity
    guid: 19ae7796d04435c4492c6918c436c549
  - enabled: 1
    path: Assets/Scenes/Game2.unity
    guid: 2cda990e2423bbf4892e6590ba056729
  - enabled: 0
    path: 
    guid: 00000000000000000000000000000000
  - enabled: 1
    path: Assets/Scenes/Game3.unity
    guid: e6387d7c2320bd14c94793cebd1645eb
  m_configObjects: {}
