%YAML 1.1
%TAG !u! tag:unity3d.com,2011:
--- !u!1045 &1
EditorBuildSettings:
  m_ObjectHideFlags: 0
  serializedVersion: 2
  m_Scenes:
  - enabled: 0
    path: Assets/Scenes/NatureTestScene.unity
    guid: 1834e62c9866b594ea10cfb2a5464598
  - enabled: 0
    path: Assets/ExternalAssets/NatureManufacture Assets/Meadow Environment Dynamic
      Nature/Demo Scenes/Overview Scene.unity
    guid: 4823b8db26ed33949b6405ba6f484644
  - enabled: 0
    path: Assets/ExternalAssets/NatureManufacture Assets/Meadow Environment Dynamic
      Nature/Demo Scenes/Unity Standard Demo Scene.unity
    guid: 98069e6af3a8c7b4695577be2afc6b78
  - enabled: 1
    path: Assets/Scenes/FinalScenes/StartScene.unity
    guid: 8384e9e7d25990e48b209a5fa82b3280
  - enabled: 1
    path: Assets/Scenes/AlejandroScene.unity
    guid: 1f2326007dc3d5b4cb98ead67d9ddd7e
  - enabled: 0
    path: Assets/Scenes/HugoScene.unity
    guid: 06341ddf24f39e144bf17f8fb21dd248
  m_configObjects: {}
