%YAML 1.1
%TAG !u! tag:unity3d.com,2011:
--- !u!114 &11400000
MonoBehaviour:
  m_ObjectHideFlags: 0
  m_CorrespondingSourceObject: {fileID: 0}
  m_PrefabInstance: {fileID: 0}
  m_PrefabAsset: {fileID: 0}
  m_GameObject: {fileID: 0}
  m_Enabled: 1
  m_EditorHideFlags: 0
  m_Script: {fileID: 11500000, guid: cfcc4faea4a52ab4bab60bd6f85458af, type: 3}
  m_Name: Rifle
  m_EditorClassIdentifier: 
  _name: Rifle
  _damage: 0
  _range: 0
  _atackStatus: 0
  _weaponType: 0
  _coolDown: 0
  _indexLayer: 3
  _weaponModel: {fileID: 8709906637581641129, guid: 6bc6c8eaef656d941839b509394e6127, type: 3}
  _positon: {x: -0.044, y: 0.251, z: 0.012}
  _rotation: {x: -182.41, y: 1.100998, z: 91.885}
