%YAML 1.1
%TAG !u! tag:unity3d.com,2011:
--- !u!114 &11400000
MonoBehaviour:
  m_ObjectHideFlags: 0
  m_CorrespondingSourceObject: {fileID: 0}
  m_PrefabInstance: {fileID: 0}
  m_PrefabAsset: {fileID: 0}
  m_GameObject: {fileID: 0}
  m_Enabled: 1
  m_EditorHideFlags: 0
  m_Script: {fileID: 11500000, guid: 5eeaae45b9f646a4991cd3d1b152a132, type: 3}
  m_Name: EnergyGalik
  m_EditorClassIdentifier: 
  _name: CannonGalik
  _damage: 20
  _cost: 10
  _ball: {fileID: 6086573251392736610, guid: da5e418ea0fe1d94992a1921b72dbd2f, type: 3}
  _speed: 15
  _spriteBall: {fileID: 1241925558, guid: f0107fe3c0eafa64998503a2876b8124, type: 3}
  _description: 'Habilidad veloz '
  _price: 100
