%YAML 1.1
%TAG !u! tag:unity3d.com,2011:
--- !u!74 &7400000
AnimationClip:
  m_ObjectHideFlags: 0
  m_CorrespondingSourceObject: {fileID: 0}
  m_PrefabInstance: {fileID: 0}
  m_PrefabAsset: {fileID: 0}
  m_Name: Portal
  serializedVersion: 6
  m_Legacy: 0
  m_Compressed: 0
  m_UseHighQualityCurve: 1
  m_RotationCurves: []
  m_CompressedRotationCurves: []
  m_EulerCurves: []
  m_PositionCurves: []
  m_ScaleCurves: []
  m_FloatCurves: []
  m_PPtrCurves:
  - curve:
    - time: 0
      value: {fileID: -87030524, guid: 8d39d28c3a50e964f8e0912fb83c54fc, type: 3}
    - time: 0.14285715
      value: {fileID: -1617771394, guid: 8d39d28c3a50e964f8e0912fb83c54fc, type: 3}
    - time: 0.2857143
      value: {fileID: 342509074, guid: 8d39d28c3a50e964f8e0912fb83c54fc, type: 3}
    - time: 0.42857143
      value: {fileID: 10716206, guid: 8d39d28c3a50e964f8e0912fb83c54fc, type: 3}
    - time: 0.5714286
      value: {fileID: -214170274, guid: 8d39d28c3a50e964f8e0912fb83c54fc, type: 3}
    - time: 0.71428573
      value: {fileID: 1980691567, guid: 8d39d28c3a50e964f8e0912fb83c54fc, type: 3}
    - time: 0.85714287
      value: {fileID: -400855845, guid: 8d39d28c3a50e964f8e0912fb83c54fc, type: 3}
    - time: 1
      value: {fileID: 1681845007, guid: 8d39d28c3a50e964f8e0912fb83c54fc, type: 3}
    - time: 1.1428572
      value: {fileID: -1932056640, guid: 8d39d28c3a50e964f8e0912fb83c54fc, type: 3}
    - time: 1.2857143
      value: {fileID: -1986158223, guid: 8d39d28c3a50e964f8e0912fb83c54fc, type: 3}
    - time: 1.4285715
      value: {fileID: -838868692, guid: 8d39d28c3a50e964f8e0912fb83c54fc, type: 3}
    - time: 1.5714285
      value: {fileID: -12886490, guid: 8d39d28c3a50e964f8e0912fb83c54fc, type: 3}
    - time: 1.7142857
      value: {fileID: 386620021, guid: 8d39d28c3a50e964f8e0912fb83c54fc, type: 3}
    - time: 1.8571428
      value: {fileID: -965377729, guid: 8d39d28c3a50e964f8e0912fb83c54fc, type: 3}
    - time: 2
      value: {fileID: -641341881, guid: 8d39d28c3a50e964f8e0912fb83c54fc, type: 3}
    attribute: m_Sprite
    path: 
    classID: 212
    script: {fileID: 0}
  m_SampleRate: 7
  m_WrapMode: 0
  m_Bounds:
    m_Center: {x: 0, y: 0, z: 0}
    m_Extent: {x: 0, y: 0, z: 0}
  m_ClipBindingConstant:
    genericBindings:
    - serializedVersion: 2
      path: 0
      attribute: 0
      script: {fileID: 0}
      typeID: 212
      customType: 23
      isPPtrCurve: 1
    pptrCurveMapping:
    - {fileID: -87030524, guid: 8d39d28c3a50e964f8e0912fb83c54fc, type: 3}
    - {fileID: -1617771394, guid: 8d39d28c3a50e964f8e0912fb83c54fc, type: 3}
    - {fileID: 342509074, guid: 8d39d28c3a50e964f8e0912fb83c54fc, type: 3}
    - {fileID: 10716206, guid: 8d39d28c3a50e964f8e0912fb83c54fc, type: 3}
    - {fileID: -214170274, guid: 8d39d28c3a50e964f8e0912fb83c54fc, type: 3}
    - {fileID: 1980691567, guid: 8d39d28c3a50e964f8e0912fb83c54fc, type: 3}
    - {fileID: -400855845, guid: 8d39d28c3a50e964f8e0912fb83c54fc, type: 3}
    - {fileID: 1681845007, guid: 8d39d28c3a50e964f8e0912fb83c54fc, type: 3}
    - {fileID: -1932056640, guid: 8d39d28c3a50e964f8e0912fb83c54fc, type: 3}
    - {fileID: -1986158223, guid: 8d39d28c3a50e964f8e0912fb83c54fc, type: 3}
    - {fileID: -838868692, guid: 8d39d28c3a50e964f8e0912fb83c54fc, type: 3}
    - {fileID: -12886490, guid: 8d39d28c3a50e964f8e0912fb83c54fc, type: 3}
    - {fileID: 386620021, guid: 8d39d28c3a50e964f8e0912fb83c54fc, type: 3}
    - {fileID: -965377729, guid: 8d39d28c3a50e964f8e0912fb83c54fc, type: 3}
    - {fileID: -641341881, guid: 8d39d28c3a50e964f8e0912fb83c54fc, type: 3}
  m_AnimationClipSettings:
    serializedVersion: 2
    m_AdditiveReferencePoseClip: {fileID: 0}
    m_AdditiveReferencePoseTime: 0
    m_StartTime: 0
    m_StopTime: 2.142857
    m_OrientationOffsetY: 0
    m_Level: 0
    m_CycleOffset: 0
    m_HasAdditiveReferencePose: 0
    m_LoopTime: 1
    m_LoopBlend: 0
    m_LoopBlendOrientation: 0
    m_LoopBlendPositionY: 0
    m_LoopBlendPositionXZ: 0
    m_KeepOriginalOrientation: 0
    m_KeepOriginalPositionY: 1
    m_KeepOriginalPositionXZ: 0
    m_HeightFromFeet: 0
    m_Mirror: 0
  m_EditorCurves: []
  m_EulerEditorCurves: []
  m_HasGenericRootTransform: 0
  m_HasMotionFloatCurves: 0
  m_Events: []
