%YAML 1.1
%TAG !u! tag:unity3d.com,2011:
--- !u!114 &11400000
MonoBehaviour:
  m_ObjectHideFlags: 0
  m_CorrespondingSourceObject: {fileID: 0}
  m_PrefabInstance: {fileID: 0}
  m_PrefabAsset: {fileID: 0}
  m_GameObject: {fileID: 0}
  m_Enabled: 1
  m_EditorHideFlags: 0
  m_Script: {fileID: 11500000, guid: 0968392837ee28d4e97f339cfdb2cc85, type: 3}
  m_Name: Slime
  m_EditorClassIdentifier: 
  _name: Slime
  _health: 15
  _speed: 1
  _bullet: {fileID: 2390747803729949977, guid: 5f53c64fb2f498041a7cee356d3d2032, type: 3}
  _velocityBullet: 10
  _loot:
  - {fileID: 204005625852870306, guid: 247f75436cbb2254dac466471d385e37, type: 3}
  - {fileID: 4213904542382495091, guid: b1953f44551f90048ac0b7884c34a223, type: 3}
  - {fileID: 2290573392764774873, guid: dd0403735b6ce1046ab7c9911cbe04a9, type: 3}
  _key: {fileID: 5334445317194452972, guid: 1b7a77127e279544cad75a8dc3e6ab12, type: 3}
