%YAML 1.1
%TAG !u! tag:unity3d.com,2011:
--- !u!1001 &7655961303751007117
PrefabInstance:
  m_ObjectHideFlags: 0
  serializedVersion: 2
  m_Modification:
    m_TransformParent: {fileID: 0}
    m_Modifications:
    - target: {fileID: 1973797488871700, guid: 48e06088b7e195f40898a828bd389ec3, type: 3}
      propertyPath: m_Name
      value: fireball-red-tail-big
      objectReference: {fileID: 0}
    - target: {fileID: 4469022170149554, guid: 48e06088b7e195f40898a828bd389ec3, type: 3}
      propertyPath: m_LocalPosition.x
      value: -12.018763
      objectReference: {fileID: 0}
    - target: {fileID: 4469022170149554, guid: 48e06088b7e195f40898a828bd389ec3, type: 3}
      propertyPath: m_LocalPosition.y
      value: -6.2401857
      objectReference: {fileID: 0}
    - target: {fileID: 4469022170149554, guid: 48e06088b7e195f40898a828bd389ec3, type: 3}
      propertyPath: m_LocalPosition.z
      value: 0
      objectReference: {fileID: 0}
    - target: {fileID: 4469022170149554, guid: 48e06088b7e195f40898a828bd389ec3, type: 3}
      propertyPath: m_LocalRotation.x
      value: 0
      objectReference: {fileID: 0}
    - target: {fileID: 4469022170149554, guid: 48e06088b7e195f40898a828bd389ec3, type: 3}
      propertyPath: m_LocalRotation.y
      value: 0
      objectReference: {fileID: 0}
    - target: {fileID: 4469022170149554, guid: 48e06088b7e195f40898a828bd389ec3, type: 3}
      propertyPath: m_LocalRotation.z
      value: 0
      objectReference: {fileID: 0}
    - target: {fileID: 4469022170149554, guid: 48e06088b7e195f40898a828bd389ec3, type: 3}
      propertyPath: m_LocalRotation.w
      value: 1
      objectReference: {fileID: 0}
    - target: {fileID: 4469022170149554, guid: 48e06088b7e195f40898a828bd389ec3, type: 3}
      propertyPath: m_RootOrder
      value: 0
      objectReference: {fileID: 0}
    - target: {fileID: 4469022170149554, guid: 48e06088b7e195f40898a828bd389ec3, type: 3}
      propertyPath: m_LocalEulerAnglesHint.x
      value: 0
      objectReference: {fileID: 0}
    - target: {fileID: 4469022170149554, guid: 48e06088b7e195f40898a828bd389ec3, type: 3}
      propertyPath: m_LocalEulerAnglesHint.y
      value: 0
      objectReference: {fileID: 0}
    - target: {fileID: 4469022170149554, guid: 48e06088b7e195f40898a828bd389ec3, type: 3}
      propertyPath: m_LocalEulerAnglesHint.z
      value: 0
      objectReference: {fileID: 0}
    m_RemovedComponents: []
  m_SourcePrefab: {fileID: 100100000, guid: 48e06088b7e195f40898a828bd389ec3, type: 3}
