%YAML 1.1
%TAG !u! tag:unity3d.com,2011:
--- !u!1045 &1
EditorBuildSettings:
  m_ObjectHideFlags: 0
  serializedVersion: 2
  m_Scenes:
  - enabled: 1
    path: Assets/Scenes/Menu.unity
    guid: acda6c4572291a54988940874801272d
  - enabled: 1
    path: Assets/Scenes/M17UF1-Prova.unity
    guid: 9a736e86abb7448989e07a825d65a290
  m_configObjects: {}
