<svg width="55" height="55" viewBox="0 0 55 55" fill="none" xmlns="http://www.w3.org/2000/svg">
<g clip-path="url(#clip0)">
<path d="M6.91205 38.1774C6.46711 38.1774 6.10638 37.8167 6.10638 37.3718V21.3538C6.10638 20.9088 6.46711 20.5481 6.91205 20.5481C7.35699 20.5481 7.71771 20.9088 7.71771 21.3538V37.3718C7.71771 37.8167 7.35699 38.1774 6.91205 38.1774Z" fill="#86B5A5"/>
<path d="M48.0879 38.1774C47.6429 38.1774 47.2822 37.8167 47.2822 37.3718V21.3538C47.2822 20.9088 47.6429 20.5481 48.0879 20.5481C48.5328 20.5481 48.8936 20.9088 48.8936 21.3538V37.3718C48.8936 37.8167 48.5328 38.1774 48.0879 38.1774Z" fill="#86B5A5"/>
<path d="M42.423 33.9983C41.9781 33.9983 41.6174 33.6376 41.6174 33.1927V29.3456C41.6174 28.9006 41.9781 28.5399 42.423 28.5399C42.868 28.5399 43.2287 28.9006 43.2287 29.3456V33.1927C43.2287 33.6376 42.868 33.9983 42.423 33.9983Z" fill="#EAAF47"/>
<path d="M51.01 40.814H3.98996C3.68466 40.814 3.43716 40.5665 3.43716 40.2612V37.9247C3.43716 37.6194 3.68466 37.3719 3.98996 37.3719H51.0101C51.3154 37.3719 51.5629 37.6194 51.5629 37.9247V40.2612C51.5629 40.5665 51.3154 40.814 51.01 40.814Z" fill="#686D6D"/>
<path d="M51.01 40.814H46.5191V37.3718H51.01C51.3153 37.3718 51.5628 37.6193 51.5628 37.9246V40.2611C51.5629 40.5665 51.3154 40.814 51.01 40.814Z" fill="#555656"/>
<path d="M44.7855 37.3717H33.5813V33.7455C33.5813 33.4402 33.8288 33.1927 34.1341 33.1927H44.2326C44.5379 33.1927 44.7854 33.4402 44.7854 33.7455V37.3717H44.7855Z" fill="#FFC853"/>
<path d="M44.7855 37.3717H41.5017V33.1927H44.2327C44.538 33.1927 44.7855 33.4402 44.7855 33.7455V37.3717Z" fill="#EAAF47"/>
<path d="M50.0354 55H4.9646C4.6593 55 4.4118 54.7525 4.4118 54.4472V40.814H50.5883V54.4472C50.5883 54.7525 50.3407 55 50.0354 55Z" fill="#F6E5CB"/>
<path d="M50.0354 55H46.5193V40.814H50.5883V54.4472C50.5883 54.7525 50.3407 55 50.0354 55Z" fill="#ECD4B2"/>
<path d="M25.8853 37.3717H11.8117V27.0666C11.8117 26.7614 12.0592 26.5139 12.3645 26.5139H25.3324C25.6377 26.5139 25.8852 26.7614 25.8852 27.0666L25.8853 37.3717Z" fill="#9FE0FE"/>
<path d="M25.8853 37.3717H21.8782V26.5139H25.3325C25.6378 26.5139 25.8853 26.7614 25.8853 27.0666V37.3717Z" fill="#7ED0ED"/>
<path d="M22.9517 0H13.4454L11.8153 17.6611C11.8153 20.5113 14.1626 22.822 17.0581 22.822C19.9535 22.822 22.3007 20.5115 22.3008 17.6611H22.3012L22.9517 0Z" fill="#D7DCDD"/>
<path d="M41.5023 0H31.996L32.6465 17.6612H32.6469C32.6469 20.5115 34.9575 22.8221 37.8078 22.8221C40.6581 22.8221 42.9686 20.5115 42.9686 17.6612L41.5023 0Z" fill="#D7DCDD"/>
<path d="M13.4453 0H6.11723C5.85813 0 5.63373 0.180039 5.57755 0.43291L1.75064 17.6612H1.75118C1.75118 20.5115 4.00414 22.8221 6.78336 22.8221C9.56247 22.8221 11.8154 20.5116 11.8155 17.6612L13.4453 0Z" fill="#86B5A5"/>
<path d="M32.6357 17.6612L31.9966 0H22.9516L22.3012 17.6612H22.3133C22.3133 20.5115 24.624 22.8221 27.4742 22.8221C30.3244 22.8221 32.6351 20.5116 32.6351 17.6612H32.6357Z" fill="#86B5A5"/>
<path d="M53.2493 17.6612L49.4224 0.43291C49.3662 0.180039 49.1419 0 48.8828 0H41.5016L42.9274 17.6611H42.927C42.927 20.5115 45.2377 22.822 48.0879 22.822C50.9381 22.822 53.2488 20.5115 53.2488 17.6611H53.2493V17.6612Z" fill="#86B5A5"/>
<path d="M43.8064 29.3456H39.1969C38.8916 29.3456 38.6441 29.0981 38.6441 28.7928V27.2449C38.6441 26.9396 38.8916 26.6921 39.1969 26.6921H43.8064C44.1117 26.6921 44.3592 26.9396 44.3592 27.2449V28.7928C44.3593 29.098 44.1117 29.3456 43.8064 29.3456Z" fill="#9FE0FE"/>
<path d="M43.8064 29.3456H42.423V26.692H43.8064C44.1117 26.692 44.3592 26.9395 44.3592 27.2447V28.7927C44.3593 29.098 44.1117 29.3456 43.8064 29.3456Z" fill="#7ED0ED"/>
</g>
<defs>
<clipPath id="clip0">
<rect width="55" height="55" fill="white"/>
</clipPath>
</defs>
</svg>
