<svg width="50" height="50" viewBox="0 0 50 50" fill="none" xmlns="http://www.w3.org/2000/svg">
<path d="M20.3125 2.34375C19.6909 2.34375 19.0948 2.59068 18.6552 3.03022C18.2157 3.46976 17.9688 4.0659 17.9688 4.6875V6.25H22.6562V4.6875C22.6562 4.0659 22.4093 3.46976 21.9698 3.03022C21.5302 2.59068 20.9341 2.34375 20.3125 2.34375Z" fill="#0A0F7D"/>
<path d="M11.6935 31.25H28.9315C30.168 31.25 31.3539 31.7412 32.2282 32.6155C33.1026 33.4899 33.5938 34.6757 33.5938 35.9122V47.6562H7.03125V35.9122C7.03125 34.6757 7.52245 33.4899 8.39678 32.6155C9.27111 31.7412 10.457 31.25 11.6935 31.25Z" fill="#FB3260"/>
<path d="M14.0372 31.25H11.6935C10.457 31.25 9.27114 31.7412 8.39681 32.6156C7.52248 33.4899 7.03128 34.6757 7.03125 35.9122V47.6562H9.375V35.9122C9.37503 34.6757 9.86623 33.4899 10.7406 32.6156C11.6149 31.7412 12.8007 31.25 14.0372 31.25Z" fill="#D71441"/>
<path d="M44.5312 32.8125V28.2987C44.5312 27.8383 44.3483 27.3966 44.0227 27.071C43.6971 26.7454 43.2555 26.5625 42.795 26.5625H35.33C34.8695 26.5625 34.4279 26.7454 34.1023 27.071C33.7767 27.3966 33.5938 27.8383 33.5938 28.2987V32.8125L30.4688 36.7188V47.6562H47.6562V36.7188L44.5312 32.8125ZM35.9375 28.9062H42.1875V30.4688H35.9375V28.9062Z" fill="#FAB645"/>
<path d="M10.9375 11.7188H29.6875V25.7845C29.6875 27.234 29.1117 28.6242 28.0867 29.6492C27.0617 30.6742 25.6715 31.25 24.222 31.25H16.403C14.9535 31.25 13.5633 30.6742 12.5383 29.6492C11.5133 28.6242 10.9375 27.234 10.9375 25.7845V11.7188Z" fill="#FDB3BB"/>
<path d="M27.347 29.6875H19.528C18.0785 29.6875 16.6883 29.1117 15.6633 28.0867C14.6383 27.0617 14.0625 25.6715 14.0625 24.222V11.7188H10.9375V25.7845C10.9375 27.234 11.5133 28.6242 12.5383 29.6492C13.5633 30.6742 14.9535 31.25 16.403 31.25H24.222C24.9432 31.2509 25.6575 31.1085 26.3233 30.8312C26.9891 30.5539 27.5933 30.1472 28.1007 29.6346C27.851 29.6694 27.5991 29.6871 27.347 29.6875Z" fill="#FDA0AA"/>
<path d="M14.0678 5.46875H26.5572C27.3874 5.46875 28.1836 5.79855 28.7707 6.38559C29.3577 6.97263 29.6875 7.76882 29.6875 8.59902V11.7188H10.9375V8.59902C10.9375 7.76882 11.2673 6.97263 11.8543 6.38559C12.4414 5.79855 13.2376 5.46875 14.0678 5.46875Z" fill="#FB3260"/>
<path d="M17.1928 5.46875H14.0678C13.2376 5.46875 12.4414 5.79855 11.8543 6.38559C11.2673 6.97263 10.9375 7.76882 10.9375 8.59902V11.7188H14.0625V8.59902C14.0625 7.76882 14.3923 6.97263 14.9793 6.38559C15.5664 5.79855 16.3626 5.46875 17.1928 5.46875Z" fill="#D71441"/>
<path d="M15.625 11.7188H29.7231C30.5425 11.7187 31.3283 12.0442 31.9076 12.6236C32.487 13.203 32.8125 13.9888 32.8125 14.8081V14.8438H18.75C17.9212 14.8438 17.1263 14.5145 16.5403 13.9285C15.9542 13.3424 15.625 12.5476 15.625 11.7188Z" fill="#0A0F7D"/>
<path d="M18.7573 5.46875H23.4302C23.8415 5.46875 24.2488 5.54977 24.6289 5.70718C25.0089 5.8646 25.3542 6.09532 25.6451 6.38619C25.9359 6.67705 26.1667 7.02235 26.3241 7.40239C26.4815 7.78242 26.5625 8.18973 26.5625 8.60107V11.7188H15.625V8.60107C15.625 7.77033 15.955 6.97361 16.5424 6.38619C17.1299 5.79876 17.9266 5.46875 18.7573 5.46875Z" fill="#E9F6FC"/>
<path d="M25.7812 31.25C25.7812 32.4932 25.2874 33.6855 24.4083 34.5646C23.5292 35.4436 22.337 35.9375 21.0938 35.9375H19.5312C18.288 35.9375 17.0958 35.4436 16.2167 34.5646C15.3376 33.6855 14.8438 32.4932 14.8438 31.25H25.7812Z" fill="#3735C7"/>
<path d="M17.1875 31.25H14.8438C14.8437 32.4932 15.3376 33.6855 16.2167 34.5646C17.0958 35.4436 18.288 35.9375 19.5312 35.9375H21.0938C21.2254 35.9375 21.3555 35.9307 21.4844 35.92C20.313 35.8222 19.2212 35.2878 18.4253 34.4229C17.6295 33.5579 17.1877 32.4254 17.1875 31.25Z" fill="#0A0F7D"/>
<path d="M19.5312 31.25H21.0938V47.6562H19.5312V31.25Z" fill="#F01B4C"/>
<path d="M19.5312 31.25H21.0938V35.9375H19.5312V31.25Z" fill="#D71441"/>
<path d="M47.6562 47.6562H41.4062V36.7188L44.5312 32.8125L47.6562 36.7188V47.6562Z" fill="#FC8C25"/>
<path d="M44.5312 32.8125H33.5938L30.4688 36.7188H41.4062L44.5312 32.8125Z" fill="#F9E083"/>
<path d="M11.7188 39.8438H13.2812V47.6562H11.7188V39.8438Z" fill="#F01B4C"/>
<path d="M25 39.8438H28.125V41.4062H25V39.8438Z" fill="#B6B6FF"/>
</svg>
