%YAML 1.1
%TAG !u! tag:unity3d.com,2011:
--- !u!114 &11400000
MonoBehaviour:
  m_ObjectHideFlags: 0
  m_CorrespondingSourceObject: {fileID: 0}
  m_PrefabInstance: {fileID: 0}
  m_PrefabAsset: {fileID: 0}
  m_GameObject: {fileID: 0}
  m_Enabled: 1
  m_EditorHideFlags: 0
  m_Script: {fileID: 11500000, guid: de5fa446705a8a54ab08a12e8cea98c4, type: 3}
  m_Name: Hammer
  m_EditorClassIdentifier: 
  WeaponPrefab: {fileID: 4677687260686320109, guid: e838d275930c81947939fd7a8e3f50da, type: 3}
  Damage: 5
  Durability: 3
  posOffset: {x: -0.44, y: 0.115, z: 0.047}
  rotateOffset: {x: 0.7970541, y: 0.130961, z: -0.54010636, w: -0.23630303}
