%YAML 1.1
%TAG !u! tag:unity3d.com,2011:
--- !u!114 &11400000
MonoBehaviour:
  m_ObjectHideFlags: 0
  m_CorrespondingSourceObject: {fileID: 0}
  m_PrefabInstance: {fileID: 0}
  m_PrefabAsset: {fileID: 0}
  m_GameObject: {fileID: 0}
  m_Enabled: 1
  m_EditorHideFlags: 0
  m_Script: {fileID: 11500000, guid: cc91b33f876ae534aa442f4ac15520c8, type: 3}
  m_Name: Detect Player(1UPos)
  m_EditorClassIdentifier: 
  enemy: {fileID: 0}
  detectMaxDistance: 1
  mustDetect: 1
