%YAML 1.1
%TAG !u! tag:unity3d.com,2011:
--- !u!114 &11400000
MonoBehaviour:
  m_ObjectHideFlags: 0
  m_CorrespondingSourceObject: {fileID: 0}
  m_PrefabInstance: {fileID: 0}
  m_PrefabAsset: {fileID: 0}
  m_GameObject: {fileID: 0}
  m_Enabled: 1
  m_EditorHideFlags: 0
  m_Script: {fileID: 11500000, guid: b3c58b6ca73b9d14b86848d434f0e8bb, type: 3}
  m_Name: Shell
  m_EditorClassIdentifier: 
  itemObject: {fileID: 919132149155446097, guid: 0eac62a83f4e9bd4bb2ffd6a8c4e20b8, type: 3}
  displayImage: {fileID: 21300000, guid: 087381e211878d84ca589c43568443b1, type: 3}
  Value: 1000
  description: '"Beach shells"'
  MaxAmount: 10
