%YAML 1.1
%TAG !u! tag:unity3d.com,2011:
--- !u!162 &1
EditorUserSettings:
  m_ObjectHideFlags: 0
  serializedVersion: 4
  m_ConfigSettings:
    RecentlyUsedSceneGuid-0:
      value: 575456555102510c545e08234373074443164d2c2a7d2333757c4936e1b36339
      flags: 0
    RecentlyUsedSceneGuid-1:
      value: 5a5757560101590a5d0c0e24427b5d44434e4c7a7b7a23677f2b4565b7b5353a
      flags: 0
    RecentlyUsedSceneGuid-2:
      value: 5202055103075f0a550c5d2642755c44154e1a732a2927677a284d30b2b36168
      flags: 0
    RecentlyUsedSceneGuid-3:
      value: 55550603515308080e5e582140275944454e192f7a7b70332c7b4462e3b7363e
      flags: 0
    RecentlyUsedSceneGuid-4:
      value: 5b04035104065f5a5d560d73407309444f4e497e7a2b2063282b1b62e4b83539
      flags: 0
    RecentlyUsedSceneGuid-5:
      value: 5b50510251055a0e09595d7616275b4442154c79287e726978701f61b6e33661
      flags: 0
    RecentlyUsedSceneGuid-6:
      value: 56555754010d0a0c555a5e7616205d44434f4e78782d77692b7c4961bae1326d
      flags: 0
    RecentlyUsedSceneGuid-7:
      value: 07520c0400055d0d5e080f264625094413151e797b2a75647a7c1836b5b7663d
      flags: 0
    vcSharedLogLevel:
      value: 0d5e400f0650
      flags: 0
  m_VCAutomaticAdd: 1
  m_VCDebugCom: 0
  m_VCDebugCmd: 0
  m_VCDebugOut: 0
  m_SemanticMergeMode: 2
  m_DesiredImportWorkerCount: 3
  m_StandbyImportWorkerCount: 2
  m_IdleImportWorkerShutdownDelay: 60000
  m_VCShowFailedCheckout: 1
  m_VCOverwriteFailedCheckoutAssets: 1
  m_VCProjectOverlayIcons: 1
  m_VCHierarchyOverlayIcons: 1
  m_VCOtherOverlayIcons: 1
  m_VCAllowAsyncUpdate: 1
  m_ArtifactGarbageCollection: 1
