%YAML 1.1
%TAG !u! tag:unity3d.com,2011:
--- !u!114 &11400000
MonoBehaviour:
  m_ObjectHideFlags: 0
  m_CorrespondingSourceObject: {fileID: 0}
  m_PrefabInstance: {fileID: 0}
  m_PrefabAsset: {fileID: 0}
  m_GameObject: {fileID: 0}
  m_Enabled: 1
  m_EditorHideFlags: 0
  m_Script: {fileID: 11500000, guid: b3c58b6ca73b9d14b86848d434f0e8bb, type: 3}
  m_Name: Moar Fish
  m_EditorClassIdentifier: 
  itemObject: {fileID: 0}
  Value: 0
  description: 
  Amount: 0
  MaxAmount: 0
