%YAML 1.1
%TAG !u! tag:unity3d.com,2011:
--- !u!114 &11400000
MonoBehaviour:
  m_ObjectHideFlags: 0
  m_CorrespondingSourceObject: {fileID: 0}
  m_PrefabInstance: {fileID: 0}
  m_PrefabAsset: {fileID: 0}
  m_GameObject: {fileID: 0}
  m_Enabled: 1
  m_EditorHideFlags: 0
  m_Script: {fileID: 11500000, guid: bde52fb09a66b2d4b868870b5c1fb8fa, type: 3}
  m_Name: Enemy1
  m_EditorClassIdentifier: 
  enemyPrefab: {fileID: 4073687924066908198, guid: dc2b3a2cec9b1f34cbacc712a50db0db, type: 3}
  baseHealth: 10
  SpawnCD: 5
  drops:
  - {fileID: 1662050328982445886, guid: 36a7db27754fede44ad652fab8a0e6ed, type: 3}
  - {fileID: 954906207733061361, guid: e57fdb34d3951b95ab9e6596e4fb0144, type: 3}
  - {fileID: 5747935187851025932, guid: b8aa51d20cc7ad34697af1c4fda547f0, type: 3}
  - {fileID: 6883433949454667603, guid: 820208069c4b95feab5bf8ef85b99dc4, type: 3}
  - {fileID: 0}
  - {fileID: 1409844903733746086, guid: 82593fe9d1ccdd64f98574812e585078, type: 3}
  scoreValue: 20
  coinValue: 5
