%YAML 1.1
%TAG !u! tag:unity3d.com,2011:
--- !u!1001 &7574493934089938978
PrefabInstance:
  m_ObjectHideFlags: 0
  serializedVersion: 2
  m_Modification:
    m_TransformParent: {fileID: 0}
    m_Modifications:
    - target: {fileID: 2515319210217637020, guid: 66206ec31612f604fa193ac8dd325252, type: 3}
      propertyPath: m_RootOrder
      value: 0
      objectReference: {fileID: 0}
    - target: {fileID: 2515319210217637020, guid: 66206ec31612f604fa193ac8dd325252, type: 3}
      propertyPath: m_LocalScale.x
      value: 0.01
      objectReference: {fileID: 0}
    - target: {fileID: 2515319210217637020, guid: 66206ec31612f604fa193ac8dd325252, type: 3}
      propertyPath: m_LocalScale.y
      value: 0.01
      objectReference: {fileID: 0}
    - target: {fileID: 2515319210217637020, guid: 66206ec31612f604fa193ac8dd325252, type: 3}
      propertyPath: m_LocalScale.z
      value: 0.01
      objectReference: {fileID: 0}
    - target: {fileID: 2515319210217637020, guid: 66206ec31612f604fa193ac8dd325252, type: 3}
      propertyPath: m_LocalPosition.x
      value: 0
      objectReference: {fileID: 0}
    - target: {fileID: 2515319210217637020, guid: 66206ec31612f604fa193ac8dd325252, type: 3}
      propertyPath: m_LocalPosition.y
      value: 0
      objectReference: {fileID: 0}
    - target: {fileID: 2515319210217637020, guid: 66206ec31612f604fa193ac8dd325252, type: 3}
      propertyPath: m_LocalPosition.z
      value: 0
      objectReference: {fileID: 0}
    - target: {fileID: 2515319210217637020, guid: 66206ec31612f604fa193ac8dd325252, type: 3}
      propertyPath: m_LocalRotation.w
      value: 1
      objectReference: {fileID: 0}
    - target: {fileID: 2515319210217637020, guid: 66206ec31612f604fa193ac8dd325252, type: 3}
      propertyPath: m_LocalRotation.x
      value: 0
      objectReference: {fileID: 0}
    - target: {fileID: 2515319210217637020, guid: 66206ec31612f604fa193ac8dd325252, type: 3}
      propertyPath: m_LocalRotation.y
      value: 0
      objectReference: {fileID: 0}
    - target: {fileID: 2515319210217637020, guid: 66206ec31612f604fa193ac8dd325252, type: 3}
      propertyPath: m_LocalRotation.z
      value: 0
      objectReference: {fileID: 0}
    - target: {fileID: 2515319210217637020, guid: 66206ec31612f604fa193ac8dd325252, type: 3}
      propertyPath: m_LocalEulerAnglesHint.x
      value: 0
      objectReference: {fileID: 0}
    - target: {fileID: 2515319210217637020, guid: 66206ec31612f604fa193ac8dd325252, type: 3}
      propertyPath: m_LocalEulerAnglesHint.y
      value: 0
      objectReference: {fileID: 0}
    - target: {fileID: 2515319210217637020, guid: 66206ec31612f604fa193ac8dd325252, type: 3}
      propertyPath: m_LocalEulerAnglesHint.z
      value: 0
      objectReference: {fileID: 0}
    - target: {fileID: 4789983401737628806, guid: 66206ec31612f604fa193ac8dd325252, type: 3}
      propertyPath: m_Name
      value: miniBullet
      objectReference: {fileID: 0}
    - target: {fileID: 4789983401737628806, guid: 66206ec31612f604fa193ac8dd325252, type: 3}
      propertyPath: m_TagString
      value: Bullet
      objectReference: {fileID: 0}
    m_RemovedComponents:
    - {fileID: -7506865194071118261, guid: 66206ec31612f604fa193ac8dd325252, type: 3}
  m_SourcePrefab: {fileID: 100100000, guid: 66206ec31612f604fa193ac8dd325252, type: 3}
--- !u!1 &3127594482759795876 stripped
GameObject:
  m_CorrespondingSourceObject: {fileID: 4789983401737628806, guid: 66206ec31612f604fa193ac8dd325252, type: 3}
  m_PrefabInstance: {fileID: 7574493934089938978}
  m_PrefabAsset: {fileID: 0}
--- !u!114 &1463295275165732014
MonoBehaviour:
  m_ObjectHideFlags: 0
  m_CorrespondingSourceObject: {fileID: 0}
  m_PrefabInstance: {fileID: 0}
  m_PrefabAsset: {fileID: 0}
  m_GameObject: {fileID: 3127594482759795876}
  m_Enabled: 1
  m_EditorHideFlags: 0
  m_Script: {fileID: 11500000, guid: fd520492b0a99384ba95edbabe5ba070, type: 3}
  m_Name: 
  m_EditorClassIdentifier: 
  speed: 6
