%YAML 1.1
%TAG !u! tag:unity3d.com,2011:
--- !u!114 &11400000
MonoBehaviour:
  m_ObjectHideFlags: 0
  m_CorrespondingSourceObject: {fileID: 0}
  m_PrefabInstance: {fileID: 0}
  m_PrefabAsset: {fileID: 0}
  m_GameObject: {fileID: 0}
  m_Enabled: 1
  m_EditorHideFlags: 0
  m_Script: {fileID: 11500000, guid: 56b29e27b44f98f46942bae16cea3a76, type: 3}
  m_Name: StunGun
  m_EditorClassIdentifier: 
  type: 0
  Image: {fileID: 21300000, guid: 132ade65748de4545bd78d257c6eea90, type: 3}
  Description: 
  BasePrice: 200
  minAmount: 0
  maxAmount: 0
  currentAmount: 0
  sprite: {fileID: 21300000, guid: 132ade65748de4545bd78d257c6eea90, type: 3}
  color: {r: 0.49056602, g: 0.0069419593, b: 0.44740945, a: 1}
  ammo: 182
  bullet: {fileID: 4789983401737628806, guid: 6a75cc70218edaf45896a97719daf5b1, type: 3}
  damage: 0
  shotCoolDown: 0.5
  shotCount: 1
  loadValue: 60
  WeaponShot: 0
