%YAML 1.1
%TAG !u! tag:unity3d.com,2011:
--- !u!114 &11400000
MonoBehaviour:
  m_ObjectHideFlags: 0
  m_CorrespondingSourceObject: {fileID: 0}
  m_PrefabInstance: {fileID: 0}
  m_PrefabAsset: {fileID: 0}
  m_GameObject: {fileID: 0}
  m_Enabled: 1
  m_EditorHideFlags: 0
  m_Script: {fileID: 11500000, guid: 7e0af9ae0e201a08fab5a2235307ef9a, type: 3}
  m_Name: SpeedBoost
  m_EditorClassIdentifier: 
  type: 1
  Image: {fileID: 21300000, guid: 4e63bc88a6a5102fda3627e8407a5905, type: 3}
  Description: 
  BasePrice: 50
  minAmount: 0
  maxAmount: 0
  currentAmount: 0
  consumableType: 0
  powerX: 1
  powerY: 1
  powerZ: 2
  duration: 10
