Division,WeightClassKg,Place,Name,Team,BodyweightKg,Best3SquatKg,Best3BenchKg,Best3DeadliftKg,TotalKg,Equipment,Event,Sex
Boys,51.71,1,Rudy Garay,Los Fresnos,51.53,219.99,111.13,195.04,526.17,Single-ply,SBD,M
Boys,55.79,2,Thomas Soto,Corpus Christi Calallen,51.89,174.63,90.72,199.58,464.93,Single-ply,SBD,M
Boys,51.71,3,Robert Chapa,Gregory-Portland,51.71,165.56,83.91,195.04,444.52,Single-ply,SBD,M
Boys,55.79,4,Stevie Solis,PSJA Memorial,51.89,163.29,83.91,176.9,424.11,Single-ply,SBD,M
Boys,55.79,5,Rigo Pena,Pharr Valley View,51.89,149.69,102.06,165.56,417.3,Single-ply,SBD,M
Boys,55.79,6,Cesar Casas,Hidalgo Early College,51.89,158.76,90.72,158.76,408.23,Single-ply,SBD,M
Boys,55.79,7,Diego Pena,Roma,51.8,151.95,83.91,163.29,399.16,Single-ply,SBD,M
Boys,51.71,8,Rafael Morales,Laredo Cigarroa,51.62,142.88,92.99,158.76,394.63,Single-ply,SBD,M
Boys,51.71,9,Jerry Alaniz,Laredo Alexander,51.17,142.88,92.99,149.69,385.55,Single-ply,SBD,M
Boys,51.71,10,Martin Villarreal,Laredo United South,51.62,136.08,72.57,176.9,385.55,Single-ply,SBD,M
Boys,55.79,1,Rolando Borjas,Los Fresnos,55.52,206.38,117.93,210.92,535.24,Single-ply,SBD,M
Boys,55.79,2,Alex Solis,Weslaco East,55.34,204.12,124.74,195.04,523.9,Single-ply,SBD,M
Boys,55.79,3,Enrique Alvarez,Laredo Cigarroa,55.16,201.85,108.86,185.97,496.68,Single-ply,SBD,M
Boys,55.79,4,Daniel Chapa,Gregory-Portland,54.07,183.7,104.33,204.12,492.15,Single-ply,SBD,M
Boys,55.79,5,Omar Puente,Los Fresnos,54.43,188.24,115.67,188.24,492.15,Single-ply,SBD,M
Boys,55.79,6,Marco Oyervides,PSJA,55.52,183.7,97.52,172.37,453.59,Single-ply,SBD,M
Boys,55.79,7,Daniel Rodriguez,PSJA,55.34,158.76,95.25,183.7,437.72,Single-ply,SBD,M
Boys,59.87,8,Robert de la Cerda,Mercedes,55.97,158.76,97.52,174.63,430.91,Single-ply,SBD,M
Boys,55.79,9,Amado De La Fuente,Laredo United South,55.52,140.61,95.25,192.78,428.64,Single-ply,SBD,M
Boys,55.79,10,Mario Leos,Seguin,54.16,147.42,95.25,183.7,426.38,Single-ply,SBD,M
Boys,59.87,1,Ryan Yanez,Gregory-Portland,58.24,174.63,136.08,179.17,489.88,Single-ply,SBD,M
Boys,59.87,2,Marcos Ortiz,Laredo Alexander,59.42,183.7,113.4,183.7,480.81,Single-ply,SBD,M
Boys,59.87,3,Jeff Kearns,Gregory-Portland,59.69,181.44,99.79,188.24,469.47,Single-ply,SBD,M
Boys,59.87,4,Cesar Alfaro,Laredo United South,59.06,156.49,99.79,176.9,433.18,Single-ply,SBD,M
Boys,59.87,5,Marc Campos,San Antonio East Central,59.6,170.1,90.72,167.83,428.64,Single-ply,SBD,M
Boys,59.87,DQ,Carlos Castillo,Los Fresnos,59.69,,,,,Single-ply,SBD,M
Boys,59.87,DQ,Jesse Casares,Mercedes,58.79,,,,,Single-ply,SBD,M
Boys,67.13,DQ,Gilbert Flores,Pharr Valley View,60.06,,,,,Single-ply,SBD,M
Boys,59.87,DQ,John Bojanski,Laredo Alexander,59.06,,,,,Single-ply,SBD,M
Boys,59.87,DQ,Isaias Carrasco,Pharr Valley View,58.33,,,,,Single-ply,SBD,M
Boys,67.13,1,JJ Gonzales,Gregory-Portland,65.23,240.4,142.88,219.99,603.28,Single-ply,SBD,M
Boys,67.13,2,Ruben Salinas,Roma,66.77,226.8,122.47,204.12,553.38,Single-ply,SBD,M
Boys,67.13,3,Ernie Sandell,San Benito,66.86,190.51,127.01,210.92,528.44,Single-ply,SBD,M
Boys,67.13,4,Esteban Flores,Pharr Valley View,67.04,192.78,99.79,226.8,519.36,Single-ply,SBD,M
Boys,67.13,5,Matt Buentello,Corpus Christi Tuloso-Midway,66.59,190.51,108.86,204.12,503.49,Single-ply,SBD,M
Boys,74.84,6,Edward Palomin,Weslaco,67.22,195.04,113.4,188.24,496.68,Single-ply,SBD,M
Boys,67.13,DQ,Carbe Seaman,Victoria St. Joseph,66.68,176.9,,,,Single-ply,SBD,M
Boys,67.13,DQ,Justin Gonzalez,Weslaco,63.23,,,,,Single-ply,SBD,M
Boys,67.13,DQ,Mike Benevides,Laredo Cigarroa,66.59,,,,,Single-ply,SBD,M
Boys,67.13,DQ,Joe Bazaldua,Mercedes,64.68,,,,,Single-ply,SBD,M
Boys,74.84,1,Gus Sanchez,Los Fresnos,73.03,281.23,140.61,244.94,666.78,Single-ply,SBD,M
Boys,74.84,2,Bobby Gonzalez,Weslaco East,71.94,240.4,124.74,247.21,612.35,Single-ply,SBD,M
Boys,74.84,3,Adalberto Chavez,Hidalgo Early College,73.94,244.94,156.49,208.65,610.08,Single-ply,SBD,M
Boys,74.84,4,Lonnie Overturf,Comal Canyon,71.49,213.19,147.42,235.87,596.47,Single-ply,SBD,M
Boys,74.84,5,Andy Mohl,Corpus Christi Tuloso-Midway,73.57,224.53,147.42,217.72,589.67,Single-ply,SBD,M
Boys,74.84,6,Stevin Leal,Corpus Christi Tuloso-Midway,73.75,235.87,129.27,224.53,589.67,Single-ply,SBD,M
Boys,82.1,7,Cesar Castillo,Laredo United South,75.02,204.12,131.54,204.12,539.77,Single-ply,SBD,M
Boys,74.84,DQ,Isaac Garza,PSJA Memorial,71.85,,,,,Single-ply,SBD,M
Boys,74.84,DQ,Abram Guerra,Rio Grande City,74.3,,,,,Single-ply,SBD,M
Boys,82.1,DQ,Jacob Ritch,San Antonio East Central,75.02,226.8,,,,Single-ply,SBD,M
Boys,82.1,1,Gabriel Longoria,Corpus Christi Calallen,81.92,274.42,140.61,247.21,662.24,Single-ply,SBD,M
Boys,82.1,2,Eliseo Garza,Los Fresnos,81.19,240.4,154.22,265.35,659.98,Single-ply,SBD,M
Boys,82.1,3,Ryan Torres,Gregory-Portland,80.2,256.28,154.22,244.94,655.44,Single-ply,SBD,M
Boys,82.1,4,Chris Belmares,Weslaco East,81.01,238.14,127.01,254.01,619.15,Single-ply,SBD,M
Boys,82.1,5,Brandon Castillo,Corpus Christi Calallen,80.56,233.6,147.42,231.33,612.35,Single-ply,SBD,M
Boys,82.1,6,Luis Muñoz,Hidalgo Early College,81.92,251.74,142.88,217.72,612.35,Single-ply,SBD,M
Boys,82.1,7,Javiel Rojas,Kingsville King,80.2,238.14,127.01,238.14,603.28,Single-ply,SBD,M
Boys,82.1,8,Jose de la Rosa,Roma,80.83,240.4,129.27,224.53,594.21,Single-ply,SBD,M
Boys,82.1,9,Devin Lanier,Gregory-Portland,81.83,238.14,147.42,208.65,594.21,Single-ply,SBD,M
Boys,82.1,10,Kameron Handy,Corpus Christi Tuloso-Midway,81.19,224.53,147.42,215.46,587.4,Single-ply,SBD,M
Boys,89.81,1,Jeffrey Moreno,Comal Canyon,86.36,276.69,154.22,272.16,703.07,Single-ply,SBD,M
Boys,89.81,2,Brandon Griffith,Port Lavaca Calhoun,89.27,265.35,183.7,249.48,698.53,Single-ply,SBD,M
Boys,89.81,3,Ramiro Flores,Los Fresnos,87.18,267.62,165.56,247.21,680.39,Single-ply,SBD,M
Boys,89.81,4,Steven Estevanes,Weslaco East,89.36,276.69,158.76,244.94,680.39,Single-ply,SBD,M
Boys,99.79,5,Eugene Manrique,Weslaco East,89.9,272.16,136.08,269.89,678.12,Single-ply,SBD,M
Boys,89.81,6,Ivan Arevalo,Pharr Valley View,89.81,242.67,142.88,288.03,673.58,Single-ply,SBD,M
Boys,89.81,7,Jose Saucedo,Port Lavaca Calhoun,86.55,258.55,167.83,226.8,653.17,Single-ply,SBD,M
Boys,89.81,8,Gilbert Garcia,Mission Sharyland,87.45,235.87,124.74,229.06,589.67,Single-ply,SBD,M
Boys,89.81,DQ,Richy Lopez,Laredo United South,88,,,,,Single-ply,SBD,M
Boys,89.81,DQ,Santos Dominguez,San Antonio East Central,86.82,,,,,Single-ply,SBD,M
Boys,99.79,1,Xaviel Hinojosa,Weslaco East,97.61,324.32,199.58,272.16,796.05,Single-ply,SBD,M
Boys,99.79,2,Andres Castellanos,Corpus Christi Tuloso-Midway,92.9,281.23,154.22,274.42,709.87,Single-ply,SBD,M
Boys,99.79,3,Larry Cardenas,Weslaco,96.98,263.08,151.95,251.74,666.78,Single-ply,SBD,M
Boys,99.79,4,Luis Hernandez,Edcouch-Elsa,94.35,240.4,163.29,254.01,657.71,Single-ply,SBD,M
Boys,99.79,5,Zach Garcia,Alice,95.89,249.48,154.22,254.01,657.71,Single-ply,SBD,M
Boys,99.79,6,Jesus Morales #3,Weslaco East,99.34,258.55,151.95,226.8,637.3,Single-ply,SBD,M
Boys,99.79,7,Matt Salazar,Corpus Christi Tuloso-Midway,99.43,254.01,142.88,206.38,603.28,Single-ply,SBD,M
Boys,99.79,DQ,Robert Castillo,PSJA,98.61,,,,,Single-ply,SBD,M
Boys,99.79,DQ,William Relko,Mission,99.61,,,,,Single-ply,SBD,M
Boys,99.79,DQ,Mauricio Verdin,Weslaco,97.34,,,,,Single-ply,SBD,M
Boys,109.77,1,Kohlton Tegeler,Victoria East,108.32,294.84,190.51,254.01,739.36,Single-ply,SBD,M
Boys,109.77,2,Demarco Smith,Corpus Christi Tuloso-Midway,108.77,299.37,172.37,240.4,712.14,Single-ply,SBD,M
Boys,109.77,3,Andre Evans,San Benito,106.96,267.62,158.76,283.5,709.87,Single-ply,SBD,M
Boys,109.77,4,Jose Barrios,Weslaco East,104.42,285.76,161.03,258.55,705.34,Single-ply,SBD,M
Boys,109.77,5,Sergio Guevara,Donna,108.77,258.55,158.76,269.89,687.19,Single-ply,SBD,M
Boys,109.77,6,Christian Garcia,Weslaco East,105.87,272.16,156.49,254.01,682.66,Single-ply,SBD,M
Boys,109.77,7,Taylor Nolte,Gregory-Portland,103.42,254.01,142.88,254.01,650.91,Single-ply,SBD,M
Boys,109.77,8,Sam Salazar,Weslaco East,107.86,256.28,172.37,222.26,650.91,Single-ply,SBD,M
Boys,109.77,DQ,Joe Cantu,Weslaco,108.86,,,,,Single-ply,SBD,M
Boys,109.77,DQ,Victor Martinez,Laredo Martin,108.41,,,,,Single-ply,SBD,M
Boys,124.74,1,Carlos Cuellar,Weslaco East,121.56,331.12,206.38,267.62,805.13,Single-ply,SBD,M
Boys,124.74,2,Will Cavanaugh,Comal Canyon,120.47,294.84,170.1,238.14,703.07,Single-ply,SBD,M
Boys,124.74,3,Robert Lugo,Weslaco,120.93,281.23,156.49,238.14,675.85,Single-ply,SBD,M
Boys,124.74,4,Roy Valdez,Los Fresnos,120.02,281.23,147.42,242.67,671.32,Single-ply,SBD,M
Boys,124.74,5,Robert Huitron,San Antonio Southside,114.12,283.5,151.95,229.06,664.51,Single-ply,SBD,M
Boys,124.74,6,Juan Rodriguez,Edcouch-Elsa,119.39,260.82,154.22,244.94,659.98,Single-ply,SBD,M
Boys,124.74,7,Alejandro Villarreal,Hidalgo Early College,123.92,281.23,142.88,226.8,650.91,Single-ply,SBD,M
Boys,124.74,8,Justin Rosas,Floresville,120.29,254.01,151.95,240.4,646.37,Single-ply,SBD,M
Boys,124.74,9,Blake Dahlberg,Gregory-Portland,110.4,249.48,142.88,229.06,621.42,Single-ply,SBD,M
Boys,124.74,DQ,Jorge Alvarez,Edcouch-Elsa,121.11,,,,,Single-ply,SBD,M
Boys,124.74,DQ,Marcello Campos,Mercedes,111.58,,,,,Single-ply,SBD,M
Boys,124.74,DQ,Robert Garcia,Mission Sharyland,114.12,,,,,Single-ply,SBD,M
Boys,124.74+,1,Jorge Mendez,Pharr Valley View,137.08,312.98,167.83,256.28,737.09,Single-ply,SBD,M
Boys,124.74+,2,Jonathon Saldana,Floresville,144.24,317.51,156.49,249.48,723.48,Single-ply,SBD,M
Boys,124.74+,3,Adam Aleman,Beeville Jones,150.14,299.37,149.69,242.67,691.73,Single-ply,SBD,M
Boys,124.74+,4,Mark Alarcon,San Antonio East Central,133.36,258.55,145.15,226.8,630.49,Single-ply,SBD,M
Boys,124.74+,5,Dylan Strickland,Corpus Christi Calallen,133.54,238.14,145.15,231.33,614.62,Single-ply,SBD,M
Boys,124.74+,DQ,Juan Zuniga,Mission,127.46,,,,,Single-ply,SBD,M
Boys,124.74+,DQ,Jason Guerra,Rio Grande City,128,308.44,,,,Single-ply,SBD,M
Boys,124.74+,DQ,Mike Benevides,San Benito,152.86,,,,,Single-ply,SBD,M
Boys,124.74+,DQ,TaMarcus Jackson,Victoria East,135.9,,,,,Single-ply,SBD,M
Boys,124.74+,DQ,Mark Reyes,Hidalgo Early College,135.17,,,,,Single-ply,SBD,M
