Place,Name,Sex,Event,Division,WeightClassKg,Equipment,BirthYear,State,BodyweightKg,Squat1Kg,Squat2Kg,Squat3Kg,Best3SquatKg,Bench1Kg,Bench2Kg,Bench3Kg,Best3BenchKg,Deadlift1Kg,Deadlift2Kg,Deadlift3Kg,Best3DeadliftKg,TotalKg,Age,BirthDate
1,Katie Rancer,F,B,FR-Jr,72,Raw,1998,NC,71.45,,,,,60,-67.5,-67.5,60.0,,,,,60,,
1,Tracy Cook,F,B,FR-M1a,72,Raw,1970,NC,69.94,,,,,80,85,90,90.0,,,,,90,,
2,Kimba Reams,F,B,FR-M1a,72,Raw,1976,SC,68.66,,,,,80,82.5,-87.5,82.5,,,,,82.5,,
1,Lori Wilson,F,B,FR-M1a,84+,Raw,1972,NC,120.96,,,,,107.5,115,-117.5,115.0,,,,,115,,
2,Sarah Johnson,F,B,FR-M1a,84+,Raw,1973,NC,111.12,,,,,67.5,-72.5,-72.5,67.5,,,,,67.5,,
DQ,Jacqueline Todd,F,B,FR-M2a,84+,Raw,1965,SC,121.46,,,,,67.5,72.5,77.5,77.5,,,,,,,
1,Tracy Cook,F,B,FR-O,72,Raw,1970,NC,69.94,,,,,80,85,90,90.0,,,,,90,,
2,Kimba Reams,F,B,FR-O,72,Raw,1976,SC,68.66,,,,,80,82.5,-87.5,82.5,,,,,82.5,,
1,Holli Mann,F,B,FR-O,84,Raw,1985,NC,74.18,,,,,62.5,65,-70,65.0,,,,,65,,
1,Lori Wilson,F,B,FR-O,84+,Raw,1972,NC,120.96,,,,,107.5,115,-117.5,115.0,,,,,115,,
2,Sarah Johnson,F,B,FR-O,84+,Raw,1973,NC,111.12,,,,,67.5,-72.5,-72.5,67.5,,,,,67.5,,
1,David Babb,M,B,MR-M1a,83,Raw,1978,NC,82.65,,,,,160,165,170,170.0,,,,,170,,
DQ,Eric Patton,M,B,MR-M2a,83,Raw,1962,SC,81.90,,,,,-135,-135,-135,,,,,,,,
1,Eric Andrews,M,B,MR-M2a,120,Raw,1968,NC,119.90,,,,,165,-175,-175,165.0,,,,,165,,
2,Tony Hennis,M,B,MR-M2a,120,Raw,1967,NC,117.75,,,,,-155,160,-165,160.0,,,,,160,,
1,David Riley,M,B,MR-M3a,93,Raw,1958,NC,91.60,,,,,125,130,132.5,132.5,,,,,132.5,,
1,Mike Jordan,M,B,MR-O,74,Raw,1990,NC,73.95,,,,,120,130,135,135.0,,,,,135,,
1,David Babb,M,B,MR-O,83,Raw,1978,NC,82.65,,,,,160,165,170,170.0,,,,,170,,
2,Michael Ware,M,B,MR-O,83,Raw,1989,SC,83.00,,,,,145,150,-160,150.0,,,,,150,,
1,Josh Leonard,M,B,MR-O,93,Raw,1983,NC,91.75,,,,,177.5,185,190,190.0,,,,,190,,
2,Derrick Moser,M,B,MR-O,93,Raw,1995,SC,90.95,,,,,130,135,-142.5,135.0,,,,,135,,
1,Justin Bailey,M,B,MR-O,120,Raw,1988,SC,111.90,,,,,190,205,217.5,217.5,,,,,217.5,,
2,Tony Hennis,M,B,MR-O,120,Raw,1967,NC,117.75,,,,,-155,160,-165,160.0,,,,,160,,
1,Eric Andrews,M,B,MR-T2,93,Raw,2001,NC,91.15,,,,,92.5,97.5,102.5,102.5,,,,,102.5,,
DQ,Jonathan Todd,M,B,MR-Y3,66,Raw,2006,SC,64.95,,,,,-30,-30,32.5,32.5,,,,,,,
1,Arielle Patra,F,SBD,FR-Jr,57,Raw,1997,NC,56.25,110,117.5,-127.5,117.5,60,62.5,-67.5,62.5,132.5,137.5,-145,137.5,317.5,,
1,Gabrielle Dardis,F,SBD,FR-Jr,63,Raw,1995,NC,60.15,100,105,-110,105.0,60,65,-70,65.0,117.5,125,127.5,127.5,297.5,,
2,Lanie Isenhour,F,SBD,FR-Jr,63,Raw,1999,NC,60.72,80,87.5,92.5,92.5,45,50,52.5,52.5,110,117.5,125,125.0,270,,
1,Ashley Coursey,F,SBD,FR-Jr,72,Raw,1995,GA,70.30,122.5,-132.5,-137.5,122.5,65,-67.5,-67.5,65.0,147.5,160,165,165.0,352.5,,
2,Katie Rancer,F,SBD,FR-Jr,72,Raw,1998,NC,71.45,-92.5,95,100,100.0,60,-67.5,-67.5,60.0,97.5,107.5,115,115.0,275,,
1,Zoe McDaniel,F,SBD,FR-Jr,84+,Raw,1999,NC,86.28,112.5,120,127.5,127.5,62.5,67.5,-70,67.5,127.5,135,142.5,142.5,337.5,,
1,Lisa Womble,F,SBD,FR-M1a,57,Raw,1977,NC,55.36,97.5,102.5,-105,102.5,52.5,57.5,-60,57.5,122.5,135,140,140.0,300,,
1,Michele Moe,F,SBD,FR-M1a,63,Raw,1969,NC,62.10,95,102.5,107.5,107.5,60,62.5,65,65.0,130,135,140,140.0,312.5,,
2,Carolyn Bellion,F,SBD,FR-M1a,63,Raw,1975,NC,59.64,67.5,70,75,75.0,-50,50,-55,50.0,87.5,92.5,97.5,97.5,222.5,,
1,Tracy Cook,F,SBD,FR-M1a,72,Raw,1970,NC,69.94,125,132.5,137.5,137.5,80,85,90,90.0,157.5,165,175,175.0,402.5,,
2,Letitia Smith,F,SBD,FR-M1a,72,Raw,1978,NC,66.12,70,-80,80,80.0,37.5,-42.5,42.5,42.5,70,80,82.5,82.5,205,,
1,Tomika Baldwin,F,SBD,FR-M1a,84,Raw,1970,NC,83.06,115,125,135,135.0,65,72.5,75,75.0,157.5,170,177.5,177.5,387.5,,
1,Kristin McCarthy,F,SBD,FR-M1a,84+,Raw,1973,NC,102.66,140,145,147.5,147.5,75,80,82.5,82.5,167.5,175,-180,175.0,405,,
2,Sarah Johnson,F,SBD,FR-M1a,84+,Raw,1973,NC,111.12,85,90,92.5,92.5,67.5,-72.5,-72.5,67.5,92.5,97.5,107.5,107.5,267.5,,
1,Karen Czuba-Gibson,F,SBD,FR-M2a,52,Raw,1962,SC,51.12,65,72.5,77.5,77.5,42.5,-50,-50,42.5,70,75,80,80.0,200,,
1,Kitt Foster,F,SBD,FR-M2a,57,Raw,1966,SC,53.86,82.5,87.5,92.5,92.5,60,65,70,70.0,120,125,-130,125.0,287.5,,
1,Michelle Clifton,F,SBD,FR-M2a,63,Raw,1968,SC,62.00,65,80,-92.5,80.0,42.5,-47.5,-47.5,42.5,-105,105,110,110.0,232.5,,
1,Kim Lewis,F,SBD,FR-M2a,72,Raw,1967,NC,71.92,90,97.5,105,105.0,50,57.5,-62.5,57.5,125,140,145,145.0,307.5,,
DQ,Jacqueline Todd,F,SBD,FR-M2a,84+,Raw,1965,SC,121.46,95,100,-115,100.0,67.5,72.5,77.5,77.5,120,127.5,137.5,137.5,,,
1,Jenny Song,F,SBD,FR-O,52,Raw,1988,NC,49.74,77.5,85,90,90.0,42.5,47.5,-50,47.5,110,-120,120,120.0,257.5,,
1,Heather Faas,F,SBD,FR-O,57,Raw,1983,SC,55.26,115,125,130,130.0,62.5,67.5,70,70.0,157.5,162.5,167.5,167.5,367.5,,
2,Arielle Patra,F,SBD,FR-O,57,Raw,1997,NC,56.25,110,117.5,-127.5,117.5,60,62.5,-67.5,62.5,132.5,137.5,-145,137.5,317.5,,
3,Lisa Womble,F,SBD,FR-O,57,Raw,1977,NC,55.36,97.5,102.5,-105,102.5,52.5,57.5,-60,57.5,122.5,135,140,140.0,300,,
1,Robyn Machado,F,SBD,FR-O,63,Raw,1986,NC,57.68,140,147.5,150,150.0,82.5,85,87.5,87.5,152.5,160,167.5,167.5,405,,
2,Michele Moe,F,SBD,FR-O,63,Raw,1969,NC,62.10,95,102.5,107.5,107.5,60,62.5,65,65.0,130,135,140,140.0,312.5,,
3,Jerri Lamar,F,SBD,FR-O,63,Raw,1989,NC,60.66,105,110,115,115.0,52.5,57.5,60,60.0,115,122.5,-127.5,122.5,297.5,,
4,Holly Schmidt,F,SBD,FR-O,63,Raw,1988,NC,62.20,-85,-87.5,87.5,87.5,52.5,55,-57.5,55.0,85,87.5,90,90.0,232.5,,
5,Carolyn Bellion,F,SBD,FR-O,63,Raw,1975,NC,59.64,67.5,70,75,75.0,-50,50,-55,50.0,87.5,92.5,97.5,97.5,222.5,,
1,Paige Hubbard,F,SBD,FR-O,72,Raw,1992,OH,66.35,-147.5,147.5,-150,147.5,80,85,87.5,87.5,177.5,-185,-185,177.5,412.5,,
2,Tracy Cook,F,SBD,FR-O,72,Raw,1970,NC,69.94,125,132.5,137.5,137.5,80,85,90,90.0,157.5,165,175,175.0,402.5,,
3,Meghan Bradsher-James,F,SBD,FR-O,72,Raw,1991,NC,69.35,127.5,132.5,137.5,137.5,70,72.5,80,80.0,157.5,165,170,170.0,387.5,,
4,Heidi Charest,F,SBD,FR-O,72,Raw,1980,NC,64.36,125,135,140,140.0,80,85,-87.5,85.0,147.5,157.5,,157.5,382.5,,
5,Ashley Coursey,F,SBD,FR-O,72,Raw,1995,GA,70.30,122.5,-132.5,-137.5,122.5,65,-67.5,-67.5,65.0,147.5,160,165,165.0,352.5,,
6,Elizabeth Forsythe,F,SBD,FR-O,72,Raw,1992,NC,65.04,97.5,105,110,110.0,70,75,77.5,77.5,127.5,137.5,142.5,142.5,330,,
7,Ivey Amburgey,F,SBD,FR-O,72,Raw,1991,NC,71.00,112.5,-120,-120,112.5,62.5,65,-67.5,65.0,130,140,145,145.0,322.5,,
8,Courtney Peterman,F,SBD,FR-O,72,Raw,1988,NC,67.12,-97.5,100,-105,100.0,57.5,62.5,65,65.0,117.5,125,130,130.0,295,,
9,Erica Chaney,F,SBD,FR-O,72,Raw,1991,NC,71.40,90,97.5,105,105.0,42.5,47.5,-50,47.5,112.5,117.5,122.5,122.5,275,,
1,Maryann Murtagh,F,SBD,FR-O,84,Raw,1989,NC,74.18,127.5,132.5,-137.5,132.5,82.5,87.5,90,90.0,160,165,170,170.0,392.5,,
2,Tomika Baldwin,F,SBD,FR-O,84,Raw,1970,NC,83.06,115,125,135,135.0,65,72.5,75,75.0,157.5,170,177.5,177.5,387.5,,
3,Allyson Abbs,F,SBD,FR-O,84,Raw,1993,SC,83.30,140,-145,-145,140.0,72.5,75,-80,75.0,120,125,130,130.0,345,,
4,Holli Mann,F,SBD,FR-O,84,Raw,1985,NC,74.18,110,117.5,-122.5,117.5,62.5,65,-70,65.0,130,137.5,-142.5,137.5,320,,
5,Mercedes Wilkes,F,SBD,FR-O,84,Raw,1991,NC,74.96,115,120,125,125.0,55,-57.5,57.5,57.5,110,125,137.5,137.5,320,,
6,Natalie Howery,F,SBD,FR-O,84,Raw,1993,SC,76.60,85,90,95,95.0,47.5,52.5,-57.5,52.5,115,120,130,130.0,277.5,,
1,Michelle Jordan,F,SBD,FR-O,84+,Raw,1986,NC,96.70,155,160,-175,160.0,72.5,-85,-85,72.5,165,180,185,185.0,417.5,,
2,Jennifer Patton,F,SBD,FR-O,84+,Raw,1982,SC,108.28,142.5,152.5,-162.5,152.5,87.5,92.5,-97.5,92.5,147.5,162.5,172.5,172.5,417.5,,
3,Kristin McCarthy,F,SBD,FR-O,84+,Raw,1973,NC,102.66,140,145,147.5,147.5,75,80,82.5,82.5,167.5,175,-180,175.0,405,,
4,Ashley Banks,F,SBD,FR-O,84+,Raw,1989,NC,90.92,137.5,145,152.5,152.5,57.5,62.5,67.5,67.5,137.5,145,152.5,152.5,372.5,,
5,Sarah Johnson,F,SBD,FR-O,84+,Raw,1973,NC,111.12,85,90,92.5,92.5,67.5,-72.5,-72.5,67.5,92.5,97.5,107.5,107.5,267.5,,
DQ,Laura Chalfant,F,SBD,FR-O,84+,Raw,1991,NC,87.25,125,135,140,140.0,65,-72.5,-72.5,65.0,130,140,147.5,147.5,,,
1,Tricia Hoffman,F,SBD,FR-T1,84,Raw,2004,NC,74.80,37.5,42.5,47.5,47.5,32.5,42.5,47.5,47.5,87.5,97.5,-105,97.5,192.5,,
1,Julia Krueger,F,SBD,FR-T2,63,Raw,2003,NC,58.34,45,65,-67.5,65.0,35,40,-42.5,40.0,62.5,80,-82.5,80.0,185,,
1,Felicia Sanders,F,SBD,FR-T2,84,Raw,2002,NC,72.96,45,60,67.5,67.5,25,32.5,-40,32.5,45,80,85,85.0,185,,
1,Dr. W. Russell Robinson,M,SBD,M-M1a,105,Single-ply,1970,NC,95.40,-127.5,127.5,145,145.0,100,107.5,-122.5,107.5,160,170,-172.5,170.0,422.5,,
1,Tucker Thompson,M,SBD,MR-G,59,Raw,2003,NC,58.90,110,,,110.0,75,,,75.0,125,,,125.0,310,,
1,John Cauthen,M,SBD,MR-Jr,74,Raw,1999,SC,72.30,150,165,182.5,182.5,102.5,107.5,115,115.0,165,185,200,200.0,497.5,,
1,Kyung-Min Roh,M,SBD,MR-Jr,83,Raw,1998,SC,82.70,190,202.5,207.5,207.5,145,155,-157.5,155.0,270,287.5,-300,287.5,650,,
2,Victor Solis,M,SBD,MR-Jr,83,Raw,1995,NC,82.90,182.5,205,215,215.0,-132.5,-137.5,140,140.0,190,205,227.5,227.5,582.5,,
1,Wesley Mull,M,SBD,MR-Jr,93,Raw,1995,NC,92.65,222.5,-235,-235,222.5,177.5,-185,-185,177.5,232.5,240,-250,240.0,640,,
2,Michael Mussler,M,SBD,MR-Jr,93,Raw,1995,NC,91.50,215,225,227.5,227.5,120,127.5,130,130.0,225,240,250,250.0,607.5,,
3,Alan Carrillo,M,SBD,MR-Jr,93,Raw,1995,NC,92.15,175,185,190,190.0,130,-140,140,140.0,225,240,250,250.0,580,,
4,Ryan Karpinski,M,SBD,MR-Jr,93,Raw,1997,NC,85.20,160,167.5,172.5,172.5,100,105,-107.5,105.0,170,177.5,182.5,182.5,460,,
5,Christopher Cairo,M,SBD,MR-Jr,93,Raw,1998,NC,92.65,137.5,145,-155,145.0,92.5,97.5,-100,97.5,182.5,195,200,200.0,442.5,,
1,Dominic Bertone,M,SBD,MR-Jr,105,Raw,1998,NC,100.30,175,185,195,195.0,120,125,-132.5,125.0,215,225,230,230.0,550,,
1,Joel Reed,M,SBD,MR-Jr,120,Raw,1995,NC,118.95,135,147.5,155,155.0,110,117.5,125,125.0,210,-230,230,230.0,510,,
1,David Babb,M,SBD,MR-M1a,83,Raw,1978,NC,82.65,230,-235,240,240.0,160,165,170,170.0,230,245,260,260.0,670,,
1,Michael Barringer,M,SBD,MR-M1a,93,Raw,1970,NC,92.40,225,240,-242.5,240.0,120,127.5,132.5,132.5,225,237.5,-242.5,237.5,610,,
2,Matt Naegel,M,SBD,MR-M1a,93,Raw,1976,SC,92.25,200,207.5,212.5,212.5,152.5,160,-162.5,160.0,220,227.5,-237.5,227.5,600,,
3,John Thompson,M,SBD,MR-M1a,93,Raw,1977,SC,86.85,205,215,220,220.0,140,145,-150,145.0,217.5,230,-237.5,230.0,595,,
1,Royce Young,M,SBD,MR-M1a,105,Raw,1970,NC,104.05,-200,200,212.5,212.5,157.5,162.5,165,165.0,252.5,265,272.5,272.5,650,,
1,Jeff Carver,M,SBD,MR-M1a,120,Raw,1969,NC,119.55,205,-217.5,-217.5,205.0,-142.5,-145,145,145.0,197.5,200,-205,200.0,550,,
1,Larry Nash,M,SBD,MR-M2a,83,Raw,1960,VA,78.35,175,185,190,190.0,122.5,130,135,135.0,175,190,200,200.0,525,,
1,Michael Ferrell,M,SBD,MR-M2a,105,Raw,1969,NC,102.70,200,210,-215,210.0,132.5,137.5,142.5,142.5,200,210,215,215.0,567.5,,
2,Michael Soos,M,SBD,MR-M2a,105,Raw,1965,NC,101.90,157.5,167.5,177.5,177.5,92.5,-97.5,-97.5,92.5,185,197.5,207.5,207.5,477.5,,
1,Eric Andrews,M,SBD,MR-M2a,120,Raw,1968,NC,119.90,175,195,-205,195.0,165,-175,-175,165.0,205,217.5,230,230.0,590,,
1,Wes Evans,M,SBD,MR-M3a,74,Raw,1954,KY,73.80,145,152.5,-157.5,152.5,95,100,-102.5,100.0,185,197.5,205,205.0,457.5,,
1,David Riley,M,SBD,MR-M3a,93,Raw,1958,NC,91.60,165,-190,-190,165.0,125,130,132.5,132.5,170,195,-217.5,195.0,492.5,,
1,Jimmy Gibson,M,SBD,MR-M4a,83,Raw,1947,SC,81.30,102.5,107.5,112.5,112.5,-80,80,82.5,82.5,130,145,147.5,147.5,342.5,,
1,Matthew Arnold,M,SBD,MR-O,66,Raw,1987,NC,65.70,145,155,160,160.0,100,105,-110,105.0,200,-215,-215,200.0,465,,
2,Ty DeVries,M,SBD,MR-O,66,Raw,1990,NC,64.45,142.5,147.5,155,155.0,-97.5,100,-102.5,100.0,165,175,-182.5,175.0,430,,
1,Rodney Alexander,M,SBD,MR-O,74,Raw,1987,NC,71.15,200,210,217.5,217.5,132.5,137.5,,137.5,222.5,235,-245,235.0,590,,
2,Mike Jordan,M,SBD,MR-O,74,Raw,1990,NC,73.95,140,152.5,165,165.0,120,130,135,135.0,165,177.5,192.5,192.5,492.5,,
3,Joe Guns,M,SBD,MR-O,74,Raw,1996,NC,72.20,170,182.5,-190,182.5,115,120,-125,120.0,160,170,177.5,177.5,480,,
4,Jason Fialkowski,M,SBD,MR-O,74,Raw,1993,NC,73.50,135,140,147.5,147.5,117.5,125,130,130.0,160,170,-177.5,170.0,447.5,,
5,William Borrero,M,SBD,MR-O,74,Raw,1988,NC,73.35,102.5,112.5,125,125.0,85,92.5,95,95.0,142.5,155,165,165.0,385,,
1,Jamarr Royster,M,SBD,MR-O,83,Raw,1991,NC,82.95,282.5,295,-307.5,295.0,170,175,177.5,177.5,275,287.5,295,295.0,767.5,,
2,David Babb,M,SBD,MR-O,83,Raw,1978,NC,82.65,230,-235,240,240.0,160,165,170,170.0,230,245,260,260.0,670,,
3,Michael Ware,M,SBD,MR-O,83,Raw,1989,SC,83.00,187.5,192.5,202.5,202.5,145,150,-160,150.0,222.5,232.5,245,245.0,597.5,,
4,John Speed,M,SBD,MR-O,83,Raw,1994,SC,79.65,187.5,195,202.5,202.5,105,112.5,117.5,117.5,215,227.5,237.5,237.5,557.5,,
5,Jacob Larson,M,SBD,MR-O,83,Raw,1993,NC,79.00,137.5,145,152.5,152.5,87.5,92.5,97.5,97.5,172.5,180,185,185.0,435,,
1,Michael Masi,M,SBD,MR-O,93,Raw,1987,NC,91.10,220,230,240,240.0,140,142.5,145,145.0,240,252.5,262.5,262.5,647.5,,
2,Wesley Mull,M,SBD,MR-O,93,Raw,1995,NC,92.65,222.5,-235,-235,222.5,177.5,-185,-185,177.5,232.5,240,-250,240.0,640,,
3,Adam McGugan,M,SBD,MR-O,93,Raw,1983,SC,90.10,215,230,237.5,237.5,127.5,132.5,-137.5,132.5,247.5,262.5,-267.5,262.5,632.5,,
4,Michael Barringer,M,SBD,MR-O,93,Raw,1970,NC,92.40,225,240,-242.5,240.0,120,127.5,132.5,132.5,225,237.5,-242.5,237.5,610,,
5,Michael Mussler,M,SBD,MR-O,93,Raw,1995,NC,91.50,215,225,227.5,227.5,120,127.5,130,130.0,225,240,250,250.0,607.5,,
6,Trey Morrison,M,SBD,MR-O,93,Raw,1995,NC,90.15,187.5,197.5,210,210.0,127.5,135,140,140.0,240,252.5,-272.5,252.5,602.5,,
7,Oscar Jimenez,M,SBD,MR-O,93,Raw,1993,NC,91.10,187.5,197.5,205,205.0,137.5,142.5,-147.5,142.5,217.5,225,237.5,237.5,585,,
8,Jacob Higgins,M,SBD,MR-O,93,Raw,1997,NC,91.15,210,217.5,222.5,222.5,117.5,-125,125,125.0,207.5,215,220,220.0,567.5,,
9,Dennis Redmond,M,SBD,MR-O,93,Raw,1990,NC,92.60,190,197.5,207.5,207.5,127.5,137.5,-140,137.5,200,212.5,222.5,222.5,567.5,,
10,Daniel Richards,M,SBD,MR-O,93,Raw,1990,SC,90.85,142.5,155,157.5,157.5,135,-140,-140,135.0,175,-180,-180,175.0,467.5,,
1,Michael Jolly,M,SBD,MR-O,105,Raw,1994,NC,103.50,250,262.5,267.5,267.5,165,-172.5,-172.5,165.0,247.5,-255,-255,247.5,680,,
2,Royce Young,M,SBD,MR-O,105,Raw,1970,NC,104.05,-200,200,212.5,212.5,157.5,162.5,165,165.0,252.5,265,272.5,272.5,650,,
3,Nik Aston,M,SBD,MR-O,105,Raw,1995,NC,101.45,210,220,227.5,227.5,140,145,150,150.0,240,255,-260,255.0,632.5,,
4,Steven Kots,M,SBD,MR-O,105,Raw,1989,NC,103.15,200,210,220,220.0,150,160,-162.5,160.0,215,217.5,-225,217.5,597.5,,
5,Roberto Morelos,M,SBD,MR-O,105,Raw,1992,NC,93.15,-210,-210,210,210.0,127.5,135,140,140.0,235,245,-255,245.0,595,,
6,Alessandro Lannes,M,SBD,MR-O,105,Raw,1994,NC,97.30,170,187.5,-202.5,187.5,107.5,-112.5,-112.5,107.5,220,230,-235,230.0,525,,
DQ,Joseph Owen,M,SBD,MR-O,105,Raw,1993,NC,104.05,-205,-215,-225,,-140,152.5,-160,152.5,210,225,235,235.0,,,
1,Joe Bertone,M,SBD,MR-O,120,Raw,1993,NC,118.50,275,295,305,305.0,187.5,195,200,200.0,275,290,300,300.0,805,,
2,Jevon Elliott,M,SBD,MR-O,120,Raw,1990,NC,117.25,245,255,265,265.0,165,175,-180,175.0,290,305,317.5,317.5,757.5,,
3,Kevin West,M,SBD,MR-O,120,Raw,1992,NC,115.20,262.5,,,262.5,147.5,155,-165,155.0,272.5,277.5,280,280.0,697.5,,
4,Josh Banks,M,SBD,MR-O,120,Raw,1987,NC,119.65,200,210,-215,210.0,157.5,165,-167.5,165.0,227.5,-242.5,-242.5,227.5,602.5,,
5,Patrick Stroup,M,SBD,MR-O,120,Raw,1988,SC,119.30,187.5,197.5,210,210.0,122.5,-130,-130,122.5,227.5,240,250,250.0,582.5,,
6,Jeff Carver,M,SBD,MR-O,120,Raw,1969,NC,119.55,205,-217.5,-217.5,205.0,-142.5,-145,145,145.0,197.5,200,-205,200.0,550,,
7,David Pavlics,M,SBD,MR-O,120,Raw,1984,NC,118.90,142.5,152.5,160,160.0,87.5,100,-110,100.0,170,177.5,-185,177.5,437.5,,
1,Miles Lieber,M,SBD,MR-O,120+,Raw,1985,NC,127.05,215,220,-222.5,220.0,160,165,167.5,167.5,247.5,257.5,262.5,262.5,650,,
1,Max Short,M,SBD,MR-T1,83,Raw,2003,NC,79.95,125,130,135,135.0,115,125,-127.5,125.0,130,135,145,145.0,405,,
1,Ryan O'Connor,M,SBD,MR-T2,74,Raw,2002,NC,66.25,97.5,105,115,115.0,52.5,62.5,67.5,67.5,125,147.5,157.5,157.5,340,,
1,Gabriel Koeb,M,SBD,MR-T2,83,Raw,2001,NC,76.35,132.5,137.5,142.5,142.5,80,85,-87.5,85.0,185,190,-205,190.0,417.5,,
2,Konner Stoneburg,M,SBD,MR-T2,83,Raw,2002,NC,80.80,112.5,120,127.5,127.5,60,65,70,70.0,182.5,-190,-190,182.5,380,,
3,Noah Anderson,M,SBD,MR-T2,83,Raw,2003,NC,81.80,92.5,-100,102.5,102.5,52.5,57.5,65,65.0,137.5,145,160,160.0,327.5,,
1,Eric Andrews,M,SBD,MR-T2,93,Raw,2001,NC,91.15,137.5,142.5,152.5,152.5,92.5,97.5,102.5,102.5,192.5,210,227.5,227.5,482.5,,
1,Broden Thompson,M,SBD,MR-Y3,53,Raw,2005,NC,48.75,72.5,82.5,90,90.0,40,45,50,50.0,80,92.5,100,100.0,240,,
DQ,Jonathan Todd,M,SBD,MR-Y3,66,Raw,2006,SC,64.95,45,55,57.5,57.5,-30,-30,32.5,32.5,75,80,85,85.0,,,
