Division,WeightClassKg,Place,Name,Team,BodyweightKg,Best3SquatKg,Best3BenchKg,Best3DeadliftKg,TotalKg,Equipment,Event,Sex
Boys,51.71,1,Rudy Garay,Los Fresnos,50.44,199.58,102.06,188.24,489.88,Single-ply,SBD,M
Boys,55.79,2,Frankie Garza,Port Lavaca Calhoun,51.89,188.24,90.72,185.97,464.93,Single-ply,SBD,M
Boys,51.71,3,Johnny Horta,Weslaco East,51.26,174.63,83.91,199.58,458.13,Single-ply,SBD,M
Boys,51.71,4,Robert Barajas,Laredo Martin,51.53,174.63,81.65,197.31,453.59,Single-ply,SBD,M
Boys,51.71,5,Robert Chapa,Gregory-Portland,51.26,154.22,88.45,174.63,417.3,Single-ply,SBD,M
Boys,51.71,6,Daniel Chapa,Gregory-Portland,51.62,147.42,95.25,170.1,412.77,Single-ply,SBD,M
Boys,55.79,7,Rigo Pena,Pharr Valley View,51.89,147.42,95.25,156.49,399.16,Single-ply,SBD,M
Boys,51.71,8,Thomas Soto,Corpus Christi Calallen,50.89,147.42,68.04,170.1,385.55,Single-ply,SBD,M
Boys,55.79,9,Michael Sauceda,Laredo United,51.8,142.88,74.84,149.69,367.41,Single-ply,SBD,M
Boys,51.71,DQ,Diego Pena,Roma,51.71,138.35,86.18,,,Single-ply,SBD,M
Boys,55.79,1,Anibal Martinez,Los Fresnos,55.43,231.33,113.4,235.87,580.6,Single-ply,SBD,M
Boys,55.79,2,Eric Torres,Weslaco East,54.98,215.46,124.74,222.26,562.45,Single-ply,SBD,M
Boys,55.79,3,Rolando Borgas,Los Fresnos,53.8,183.7,102.06,192.78,478.54,Single-ply,SBD,M
Boys,55.79,4,Alex Solis,Weslaco East,55.25,176.9,115.67,183.7,476.27,Single-ply,SBD,M
Boys,55.79,5,Enrique Alvarez,Laredo Cigarroa,55.7,181.44,99.79,181.44,462.66,Single-ply,SBD,M
Boys,59.87,6,Enrique Gonzalez,Roma,55.88,156.49,99.79,179.17,435.45,Single-ply,SBD,M
Boys,55.79,7,Mario Leos,Seguin,55.25,151.95,102.06,176.9,430.91,Single-ply,SBD,M
Boys,55.79,8,Robert de la Cerda,Mercedes,55.7,158.76,90.72,165.56,415.04,Single-ply,SBD,M
Boys,55.79,9,Amado De La Fuente,Laredo United South,55.07,136.08,83.91,170.1,390.09,Single-ply,SBD,M
Boys,55.79,DQ,Jesse Casarez,Mercedes,54.98,,,,,Single-ply,SBD,M
Boys,59.87,1,Nick Laznovsky,Los Fresnos,59.42,258.55,117.93,235.87,612.35,Single-ply,SBD,M
Boys,59.87,2,Rolie Alaniz,Weslaco East,59.42,210.92,106.59,213.19,530.7,Single-ply,SBD,M
Boys,67.13,3,Aj Dovalina,Laredo Alexander,60.06,183.7,104.33,210.92,498.95,Single-ply,SBD,M
Boys,67.13,4,Edgar Martinez,Laredo Cigarroa,60.1,206.38,97.52,195.04,498.95,Single-ply,SBD,M
Boys,59.87,5,JJ Gonzalez,Gregory-Portland,59.87,179.17,113.4,192.78,485.34,Single-ply,SBD,M
Boys,59.87,6,Given McClure,Corpus Christi Calallen,58.97,192.78,99.79,176.9,469.47,Single-ply,SBD,M
Boys,59.87,7,John Bojanski,Laredo Alexander,59.24,183.7,90.72,183.7,458.13,Single-ply,SBD,M
Boys,59.87,8,Robert Carrasco,Pleasanton,59.87,188.24,77.11,188.24,453.59,Single-ply,SBD,M
Boys,59.87,9,Gilbert Flores,Pharr Valley View,59.87,174.63,97.52,174.63,446.79,Single-ply,SBD,M
Boys,59.87,10,Lucky Carrasco,Pharr Valley View,58.69,174.63,95.25,174.63,444.52,Single-ply,SBD,M
Boys,67.13,1,Isaac Nunez,Los Fresnos,64.05,272.16,167.83,215.46,655.44,Single-ply,SBD,M
Boys,67.13,2,Miguel Mata,Pharr Valley View,66.13,217.72,145.15,217.72,580.6,Single-ply,SBD,M
Boys,67.13,3,Ruben Salinas,Roma,66.04,224.53,127.01,197.31,548.85,Single-ply,SBD,M
Boys,67.13,4,Peter Webre,Comal Canyon,66.32,222.26,111.13,210.92,544.31,Single-ply,SBD,M
Boys,67.13,5,Joe Gonzalez,Pharr Valley View,66.68,204.12,117.93,222.26,544.31,Single-ply,SBD,M
Boys,67.13,6,Ryan Gomez,Corpus Christi Calallen,63.96,188.24,127.01,199.58,514.83,Single-ply,SBD,M
Boys,67.13,7,Jc Carpenter,Seguin,64.95,183.7,117.93,208.65,510.29,Single-ply,SBD,M
Boys,67.13,DQ,Izzy Garza,PSJA Memorial,66.86,204.12,131.54,,,Single-ply,SBD,M
Boys,67.13,DQ,Dalton Torres,Beeville Jones,63.96,229.06,,,,Single-ply,SBD,M
Boys,67.13,DQ,Josh Leal,Port Lavaca Calhoun,66.5,199.58,113.4,,,Single-ply,SBD,M
Boys,82.1,1,Zach Garza,Corpus Christi Calallen,75.02,276.69,147.42,272.16,696.26,Single-ply,SBD,M
Boys,74.84,2,Jaime Cortez,Mission Sharyland,74.75,260.82,145.15,260.82,666.78,Single-ply,SBD,M
Boys,74.84,3,Brandon Castillo,Corpus Christi Calallen,74.3,226.8,129.27,233.6,589.67,Single-ply,SBD,M
Boys,74.84,4,Aaron Mungia,Weslaco East,74.84,222.26,127.01,240.4,589.67,Single-ply,SBD,M
Boys,74.84,5,Ryan Torres,Gregory-Portland,74.3,217.72,138.35,222.26,578.33,Single-ply,SBD,M
Boys,74.84,6,Jermiah Puentes,Beeville Jones,72.57,229.06,122.47,222.26,573.79,Single-ply,SBD,M
Boys,74.84,7,Armando Hernandez,Los Fresnos,73.84,208.65,149.69,204.12,562.45,Single-ply,SBD,M
Boys,74.84,8,Joey Calzada,Port Lavaca Calhoun,74.57,219.99,129.27,204.12,553.38,Single-ply,SBD,M
Boys,82.1,DQ,Cesar Castillo,Laredo United South,75.02,,,,,Single-ply,SBD,M
Boys,74.84,DQ,Art Medrano,Weslaco East,74.48,,,,,Single-ply,SBD,M
Boys,82.1,1,Gabriel Longoria,Corpus Christi Calallen,81.65,272.16,149.69,240.4,662.24,Single-ply,SBD,M
Boys,82.1,2,Justin Garcia,Alice,78.47,244.94,140.61,226.8,612.35,Single-ply,SBD,M
Boys,82.1,3,Jacob Castillo,Alice,80.65,240.4,145.15,226.8,612.35,Single-ply,SBD,M
Boys,82.1,4,Genaro Trevino,Beeville Jones,80.74,247.21,156.49,208.65,612.35,Single-ply,SBD,M
Boys,82.1,5,Chris Belmares,Weslaco East,81.37,231.33,136.08,235.87,603.28,Single-ply,SBD,M
Boys,82.1,6,Jeff Moreno,Comal Canyon,78.38,247.21,115.67,231.33,594.21,Single-ply,SBD,M
Boys,82.1,7,Linden Reed,Comal Canyon,78.38,235.87,124.74,231.33,591.94,Single-ply,SBD,M
Boys,89.81,8,Trey Villarreal,San Benito,82.28,240.4,147.42,204.12,591.94,Single-ply,SBD,M
Boys,82.1,9,Jesus Espinosa,Alice,81.37,240.4,129.27,208.65,578.33,Single-ply,SBD,M
Boys,82.1,DQ,Erik Ramirez,Donna,80.29,,,,,Single-ply,SBD,M
Boys,89.81,1,Ian Bell,Comal Canyon,88.18,317.51,158.76,317.51,793.79,Single-ply,SBD,M
Boys,89.81,2,Xaviel Hinojosa,Weslaco East,89.36,294.84,176.9,263.08,734.82,Single-ply,SBD,M
Boys,89.81,3,Brandon Griffith,Port Lavaca Calhoun,88.36,260.82,174.63,226.8,662.24,Single-ply,SBD,M
Boys,89.81,4,Ivan Gonzalez,Los Fresnos,88.99,272.16,145.15,238.14,655.44,Single-ply,SBD,M
Boys,89.81,5,Aaron Castillo,Los Fresnos,86.91,276.69,147.42,229.06,653.17,Single-ply,SBD,M
Boys,89.81,6,Lazaro Smith,Beeville Jones,89.81,269.89,133.81,242.67,646.37,Single-ply,SBD,M
Boys,89.81,7,Jose Saucedo,Port Lavaca Calhoun,86.45,258.55,165.56,215.46,639.57,Single-ply,SBD,M
Boys,99.79,8,Daniel Salazar,San Antonio Southside,89.99,272.16,142.88,204.12,619.15,Single-ply,SBD,M
Boys,89.81,9,Joseph Garcia,Weslaco East,89.09,226.8,145.15,242.67,614.62,Single-ply,SBD,M
Boys,89.81,DQ,Colton Williams,Port Lavaca Calhoun,88,249.48,142.88,,,Single-ply,SBD,M
Boys,99.79,1,Victor Ruiz,Weslaco East,98.7,322.05,172.37,244.94,739.36,Single-ply,SBD,M
Boys,99.79,2,Andre Evans,San Benito,98.25,290.3,124.74,258.55,673.58,Single-ply,SBD,M
Boys,99.79,3,Ivan Arrevalo,Pharr Valley View,97.16,256.28,142.88,260.82,659.98,Single-ply,SBD,M
Boys,99.79,4,Andres Castellanos,Corpus Christi Tuloso-Midway,96.8,281.23,138.35,238.14,657.71,Single-ply,SBD,M
Boys,99.79,5,Nathan Westbrook,Kingsville King,97.89,260.82,163.29,233.6,657.71,Single-ply,SBD,M
Boys,99.79,6,Jerry Nino,Laredo Martin,99.52,256.28,167.83,233.6,657.71,Single-ply,SBD,M
Boys,99.79,7,Tim Hicks,Port Lavaca Calhoun,99.52,260.82,149.69,226.8,637.3,Single-ply,SBD,M
Boys,99.79,8,Thomas Gray,San Antonio East Central,98.07,226.8,140.61,249.48,616.89,Single-ply,SBD,M
Boys,99.79,9,Robert Castillo,PSJA,97.52,229.06,147.42,233.6,610.08,Single-ply,SBD,M
Boys,99.79,DQ,Aaron Garcia,Los Fresnos,96.89,,,,,Single-ply,SBD,M
Boys,109.77,1,Preston Turner,Victoria Memorial,108.95,328.85,226.8,258.55,814.2,Single-ply,SBD,M
Boys,109.77,2,Freddy Chavarria,Laredo Martin,103.78,274.42,174.63,231.33,680.39,Single-ply,SBD,M
Boys,109.77,3,Kohlton Tegeler,Victoria Memorial,107.86,249.48,174.63,226.8,650.91,Single-ply,SBD,M
Boys,109.77,4,Marcelo Campos,Mercedes,107.95,249.48,142.88,233.6,625.96,Single-ply,SBD,M
Boys,109.77,5,Rafael Vasquez,Laredo United South,109.77,258.55,140.61,224.53,623.69,Single-ply,SBD,M
Boys,109.77,6,Cody Morris,Corpus Christi Calallen,104.05,238.14,120.2,226.8,585.13,Single-ply,SBD,M
Boys,109.77,DQ,Lupe Briseno,Port Lavaca Calhoun,109.13,290.3,149.69,,,Single-ply,SBD,M
Boys,109.77,DQ,Cat Salazar,Weslaco East,108.95,,,,,Single-ply,SBD,M
Boys,109.77,DQ,Larry Cardenas,Weslaco,105.32,263.08,,,,Single-ply,SBD,M
Boys,109.77,DQ,Eliseo Pena,Weslaco,108.95,,,,,Single-ply,SBD,M
Boys,124.74,1,Carlos Cuellar,Weslaco East,119.02,306.17,195.04,251.74,752.96,Single-ply,SBD,M
Boys,124.74,2,Albert Ureste,Port Lavaca Calhoun,123.74,285.76,167.83,249.48,703.07,Single-ply,SBD,M
Boys,124.74,3,Reynaldo Medina,San Antonio Southside,117.48,276.69,181.44,226.8,684.92,Single-ply,SBD,M
Boys,124.74,4,William Cavanaugh,Comal Canyon,120.93,272.16,167.83,226.8,666.78,Single-ply,SBD,M
Boys,124.74,5,Vincent Lee,Northside Holmes,123.56,272.16,167.83,226.8,666.78,Single-ply,SBD,M
Boys,124.74,6,Joey Guzman,Del Rio,121.11,244.94,165.56,238.14,648.64,Single-ply,SBD,M
Boys,124.74,7,Jorge Alvarez,Edcouch-Elsa,117.57,224.53,147.42,197.31,569.26,Single-ply,SBD,M
Boys,124.74,DQ,Juan Rodriguez,Edcouch-Elsa,122.56,,,,,Single-ply,SBD,M
Boys,124.74,DQ,Eliud Aguero,Laredo Alexander,119.57,249.48,,,,Single-ply,SBD,M
Boys,124.74,DQ,Albert Mata,San Antonio Southside,119.11,,,,,Single-ply,SBD,M
Boys,124.74+,1,Miguel Estrada,Rockport-Fulton,131.09,294.84,167.83,263.08,725.75,Single-ply,SBD,M
Boys,124.74+,2,Mando Salazar,Donna,126.55,267.62,179.17,249.48,696.26,Single-ply,SBD,M
Boys,124.74+,3,Jorge Mendez,Pharr Valley View,132.36,331.12,131.54,233.6,696.26,Single-ply,SBD,M
Boys,124.74+,4,Henry Zamora,Uvalde,129.27,290.3,163.29,226.8,680.39,Single-ply,SBD,M
Boys,124.74+,5,Mark Menchaca,Uvalde,135.99,290.3,133.81,244.94,669.05,Single-ply,SBD,M
Boys,124.74+,6,Carlos Gomez,Laredo Martin,126.19,258.55,154.22,231.33,644.1,Single-ply,SBD,M
Boys,124.74+,7,Andrew Williams,Rockport-Fulton,147.87,249.48,158.76,208.65,616.89,Single-ply,SBD,M
Boys,124.74+,8,Nykieren Wellington,Northside Holmes,134.99,238.14,113.4,249.48,601.01,Single-ply,SBD,M
Boys,124.74+,DQ,Luis Castillo,Weslaco,127.55,319.78,172.37,,,Single-ply,SBD,M
Boys,124.74+,DQ,Owen Rathburn,Comal Canyon,128.46,,,,,Single-ply,SBD,M
