Division,WeightClassKg,Place,Name,Team,BodyweightKg,Best3SquatKg,Best3BenchKg,Best3DeadliftKg,TotalKg,Equipment,Event,Sex
Boys,51.71,1,Nathan Sylakhom,Fort Worth Boswell,51.26,106.59,47.63,122.47,276.69,Single-ply,SBD,M
Boys,55.79,1,Anthony Phimmasone,Fort Worth Boswell,53.52,131.54,61.23,140.61,333.39,Single-ply,SBD,M
Boys,55.79,2,Brandon Balderama,Saginaw,55.34,124.74,70.31,127.01,322.05,Single-ply,SBD,M
Boys,55.79,3,Nolan Briggs,Fort Worth Boswell,53.8,102.06,61.23,113.4,276.69,Single-ply,SBD,M
Boys,55.79,4,Zunair Waseem,Saginaw,55.34,81.65,43.09,90.72,215.46,Single-ply,SBD,M
Boys,59.87,1,Jack Fry,Fort Worth Boswell,59.69,124.74,70.31,131.54,326.59,Single-ply,SBD,M
Boys,67.13,1,Garrett Wright,Fort Worth Boswell,65.41,158.76,106.59,181.44,446.79,Single-ply,SBD,M
Boys,67.13,2,Edwin Hayden,Fort Worth Boswell,65.41,165.56,79.38,167.83,412.77,Single-ply,SBD,M
Boys,67.13,3,Kylen Hart,Weatherford,64.59,158.76,86.18,161.03,405.97,Single-ply,SBD,M
Boys,67.13,4,Collin Biggers,Fort Worth Boswell,67.13,145.15,92.99,154.22,392.36,Single-ply,SBD,M
Boys,67.13,5,Isiah Domingez,Saginaw,65.32,147.42,83.91,154.22,385.55,Single-ply,SBD,M
Boys,67.13,6,Saul Sanchez,Weatherford,63.41,138.35,81.65,149.69,369.68,Single-ply,SBD,M
Boys,67.13,7,Micheal Anderson,Weatherford,65.32,136.08,74.84,145.15,356.07,Single-ply,SBD,M
Boys,67.13,8,Colt Edwards,Fort Worth Boswell,63.87,113.4,79.38,136.08,328.85,Single-ply,SBD,M
Boys,67.13,9,Michael Bradley-Jones,Saginaw,64.41,127.01,61.23,138.35,326.59,Single-ply,SBD,M
Boys,67.13,10,Gavin Johnson,Saginaw,64.86,117.93,83.91,115.67,317.51,Single-ply,SBD,M
Boys,67.13,11,Matthew Davis,Fort Worth Boswell,65.68,90.72,52.16,102.06,244.94,Single-ply,SBD,M
Boys,74.84,1,James McAfee,Weatherford,71.3,195.04,97.52,183.7,476.27,Single-ply,SBD,M
Boys,74.84,2,Desmond Lewis,Saginaw,74.39,158.76,92.99,165.56,417.3,Single-ply,SBD,M
Boys,74.84,3,Carlos Amaro,Weatherford,69.22,145.15,90.72,154.22,390.09,Single-ply,SBD,M
Boys,82.1,1,Peyton Hetrick,Weatherford,81.74,213.19,111.13,213.19,537.51,Single-ply,SBD,M
Boys,82.1,2,Dom Orozco,Saginaw,81.65,190.51,115.67,217.72,523.9,Single-ply,SBD,M
Boys,82.1,3,Joshua Mork,Fort Worth Boswell,80.83,190.51,124.74,195.04,510.29,Single-ply,SBD,M
Boys,82.1,4,River Hall,Weatherford,78.56,179.17,115.67,179.17,474,Single-ply,SBD,M
Boys,82.1,5,Caleb Genberg,Fort Worth Boswell,80.47,172.37,104.33,149.69,426.38,Single-ply,SBD,M
Boys,82.1,6,Kenneth Manzano-Perez,Saginaw,80.74,167.83,83.91,172.37,424.11,Single-ply,SBD,M
Boys,82.1,7,Julian Diaz #2,Weatherford,80.83,147.42,79.38,156.49,383.29,Single-ply,SBD,M
Boys,89.81,1,Braden Robertson,Weatherford,84.73,251.74,145.15,231.33,628.23,Single-ply,SBD,M
Boys,89.81,2,Damon Williams,Fort Worth Boswell,86.18,210.92,138.35,226.8,576.06,Single-ply,SBD,M
Boys,89.81,3,Rishedi Tshitoko,Saginaw,83.46,208.65,111.13,238.14,557.92,Single-ply,SBD,M
Boys,89.81,4,Grffen Rhea,Saginaw,85.73,204.12,124.74,204.12,532.97,Single-ply,SBD,M
Boys,89.81,5,Patrick Hayes,Saginaw,88.9,197.31,111.13,192.78,501.22,Single-ply,SBD,M
Boys,89.81,6,Tim Parker #2,Weatherford,84.46,174.63,108.86,204.12,487.61,Single-ply,SBD,M
Boys,89.81,7,Tanner Knox,Weatherford,83.01,170.1,95.25,192.78,458.13,Single-ply,SBD,M
Boys,89.81,8,Hollan Morris,Fort Worth Boswell,88.45,165.56,95.25,176.9,437.72,Single-ply,SBD,M
Boys,89.81,9,Keondre Vassar,Saginaw,87.09,163.29,92.99,174.63,430.91,Single-ply,SBD,M
Boys,89.81,10,Jay Garcia,Fort Worth Boswell,86.27,163.29,74.84,161.03,399.16,Single-ply,SBD,M
Boys,99.79,1,Jake Beaird,Weatherford,94.35,263.08,142.88,231.33,637.3,Single-ply,SBD,M
Boys,99.79,2,Derrick Munoz,Saginaw,97.07,235.87,138.35,219.99,594.21,Single-ply,SBD,M
Boys,99.79,3,Elijah Dean,Weatherford,92.62,231.33,142.88,197.31,571.53,Single-ply,SBD,M
Boys,99.79,4,Ignacio Gonzalez,Saginaw,99.34,215.46,122.47,213.19,551.11,Single-ply,SBD,M
Boys,99.79,5,Landon Rhoades,Saginaw,97.52,215.46,92.99,204.12,512.56,Single-ply,SBD,M
Boys,99.79,6,Dejion Cash,Saginaw,99.34,195.04,127.01,172.37,494.42,Single-ply,SBD,M
Boys,99.79,7,Hayden Hall,Fort Worth Boswell,95.35,181.44,104.33,185.97,471.74,Single-ply,SBD,M
Boys,99.79,8,Will Humphrey,Fort Worth Boswell,95.89,188.24,106.59,176.9,471.74,Single-ply,SBD,M
Boys,99.79,9,Rene Olvera,Weatherford,92.99,185.97,90.72,179.17,455.86,Single-ply,SBD,M
Boys,99.79,10,Jesus Campos,Weatherford,91.17,158.76,77.11,158.76,394.63,Single-ply,SBD,M
Boys,99.79,11,Alex Bennett,Fort Worth Boswell,94.53,129.27,102.06,154.22,385.55,Single-ply,SBD,M
Boys,99.79,12,Case Mason,Saginaw,97.98,138.35,70.31,149.69,358.34,Single-ply,SBD,M
Boys,99.79,DQ,Michael Pollard,Fort Worth Boswell,98.88,,,,,Single-ply,SBD,M
Boys,109.77,1,Colton Reinhardt,Saginaw,109.77,233.6,129.27,226.8,589.67,Single-ply,SBD,M
Boys,109.77,2,Reynaldo Valenzuela,Weatherford,103.87,213.19,113.4,244.94,571.53,Single-ply,SBD,M
Boys,109.77,3,Kyrese McFarland,Fort Worth Boswell,100.61,217.72,131.54,213.19,562.45,Single-ply,SBD,M
Boys,109.77,4,Fernando Torres,Saginaw,102.97,185.97,108.86,174.63,469.47,Single-ply,SBD,M
Boys,109.77,5,Cade Taylor,Weatherford,104.33,181.44,88.45,183.7,453.59,Single-ply,SBD,M
Boys,109.77,6,Elijah Telfair,Weatherford,105.78,124.74,68.04,138.35,331.12,Single-ply,SBD,M
Boys,124.74,1,Justin Watson,Fort Worth Boswell,123.29,256.28,145.15,229.06,630.49,Single-ply,SBD,M
Boys,124.74,2,Max Michaels,Fort Worth Boswell,122.02,226.8,145.15,215.46,587.4,Single-ply,SBD,M
Boys,124.74,3,Gilbert Cortinas,Saginaw,123.38,185.97,115.67,204.12,505.76,Single-ply,SBD,M
Boys,124.74+,1,Jake Allsbrooks,Fort Worth Boswell,147.78,340.19,158.76,226.8,725.75,Single-ply,SBD,M
Boys,124.74+,2,Ethan Meese,Weatherford,146.42,254.01,138.35,201.85,594.21,Single-ply,SBD,M
Boys,124.74+,3,Jonathen Renteria,Weatherford,137.08,226.8,138.35,217.72,582.87,Single-ply,SBD,M
Boys,124.74+,DQ,Adrian Little,Saginaw,125.19,,,,,Single-ply,SBD,M
