Division,WeightClassKg,Place,Name,Team,BodyweightKg,Best3SquatKg,Best3BenchKg,Best3DeadliftKg,TotalKg,Equipment,Event,Sex
Boys,51.71,1,Toni Ogunsola,Frisco,51.35,142.88,79.38,142.88,365.14,Single-ply,SBD,M
Boys,51.71,2,Victor Peluso,Frisco Wakeland,51.03,129.27,92.99,140.61,362.87,Single-ply,SBD,M
Boys,51.71,3,Michael Robason,Frisco Wakeland,51.3,136.08,65.77,104.33,306.17,Single-ply,SBD,M
Boys,59.87,1,Dongchan Kim,Frisco,55.84,145.15,79.38,124.74,349.27,Single-ply,SBD,M
Boys,55.79,2,Marcel Roach,Carrollton Creekview,54.7,136.08,68.04,129.27,333.39,Single-ply,SBD,M
Boys,55.79,3,Ryan Allo,Carrollton Creekview,55.66,124.74,74.84,127.01,326.59,Single-ply,SBD,M
Boys,55.79,4,Rowan Wroten,Frisco Heritage,55.7,90.72,61.23,102.06,254.01,Single-ply,SBD,M
Boys,55.79,5,Rafeael Sandoval,Plano John Paul II,55.57,90.72,47.63,104.33,242.67,Single-ply,SBD,M
Boys,55.79,6,Blake Weaver,Frisco Heritage,53.66,70.31,45.36,83.91,199.58,Single-ply,SBD,M
Boys,55.79,DQ,Stephen Bevilacqua,Plano John Paul II,54.43,,,,,Single-ply,SBD,M
Boys,67.13,1,Re Knight,Frisco Centennial,60.1,156.49,81.65,131.54,369.68,Single-ply,SBD,M
Boys,59.87,2,Travis Turpin,McKinney Boyd,59.51,117.93,65.77,142.88,326.59,Single-ply,SBD,M
Boys,59.87,3,Brandon Lewellan,Frisco Wakeland,59.19,127.01,61.23,117.93,306.17,Single-ply,SBD,M
Boys,59.87,DQ,Chris Alcantar,Carrollton Creekview,59.56,133.81,,,,Single-ply,SBD,M
Boys,67.13,1,Devaughn Childress,Frisco Wakeland,66.77,206.38,97.52,181.44,485.34,Single-ply,SBD,M
Boys,67.13,2,Mason Pierce,Frisco Centennial,67.13,165.56,104.33,174.63,444.52,Single-ply,SBD,M
Boys,67.13,3,Zach Stevens,McKinney Boyd,66.63,147.42,81.65,158.76,387.82,Single-ply,SBD,M
Boys,67.13,4,Drew Dale,Frisco Liberty,64.68,140.61,95.25,122.47,358.34,Single-ply,SBD,M
Boys,67.13,5,Sean Williams,Frisco Heritage,67.13,133.81,65.77,127.01,326.59,Single-ply,SBD,M
Boys,74.84,6,Dalton Ortiz,McKinney Boyd,67.31,113.4,72.57,129.27,315.25,Single-ply,SBD,M
Boys,74.84,1,Ryan Abraham,Frisco Centennial,73.84,190.51,145.15,208.65,544.31,Single-ply,SBD,M
Boys,74.84,2,Seth Pratt,McKinney Boyd,74.71,167.83,108.86,190.51,467.2,Single-ply,SBD,M
Boys,74.84,3,Logan Swann,Frisco Wakeland,73.48,158.76,111.13,190.51,460.4,Single-ply,SBD,M
Boys,74.84,4,Nigel Barlis,Frisco Centennial,69.49,170.1,113.4,163.29,446.79,Single-ply,SBD,M
Boys,82.1,5,Briggs Lambring,Frisco,75.07,156.49,97.52,167.83,421.84,Single-ply,SBD,M
Boys,74.84,6,Van Tomety,Frisco Heritage,72.12,142.88,88.45,127.01,358.34,Single-ply,SBD,M
Boys,74.84,7,Tyler Phelps,McKinney Boyd,67.95,136.08,79.38,138.35,353.8,Single-ply,SBD,M
Boys,74.84,DQ,Neal Botteron,Frisco Heritage,72.35,,,,,Single-ply,SBD,M
Boys,74.84,DQ,Devin Barnes,Carrollton Creekview,73.71,172.37,,,,Single-ply,SBD,M
Boys,74.84,DQ,Brandon Rose,Plano John Paul II,72.67,111.13,,,,Single-ply,SBD,M
Boys,82.1,1,Collin Charles,Frisco Heritage,79.24,204.12,133.81,204.12,542.04,Single-ply,SBD,M
Boys,82.1,2,Lakeylon Rice,Frisco Centennial,79.06,199.58,136.08,183.7,519.36,Single-ply,SBD,M
Boys,82.1,3,Franke Jesse,Frisco,78.83,176.9,124.74,176.9,478.54,Single-ply,SBD,M
Boys,82.1,4,Andrew Roessler,Frisco Wakeland,77.61,176.9,113.4,154.22,444.52,Single-ply,SBD,M
Boys,82.1,5,Jordan Miller,Frisco Centennial,75.89,156.49,97.52,181.44,435.45,Single-ply,SBD,M
Boys,82.1,6,Ivan Sauerzopf,Frisco Lone Star,81.83,142.88,127.01,165.56,435.45,Single-ply,SBD,M
Boys,82.1,7,Ryan Woulfe,Frisco,76.93,163.29,106.59,149.69,419.57,Single-ply,SBD,M
Boys,82.1,8,Jack Flowers,Frisco Wakeland,82.01,174.63,83.91,156.49,415.04,Single-ply,SBD,M
Boys,82.1,9,Jakeldon Babers,Frisco Heritage,82.1,156.49,97.52,138.35,392.36,Single-ply,SBD,M
Boys,82.1,10,Oscar Gomez,Frisco Heritage,82.1,158.76,88.45,136.08,383.29,Single-ply,SBD,M
Boys,82.1,11,Sean Jones,Frisco Heritage,80.69,136.08,95.25,147.42,378.75,Single-ply,SBD,M
Boys,82.1,12,Riley Hyslop,Plano John Paul II,82.1,120.2,58.97,145.15,324.32,Single-ply,SBD,M
Boys,82.1,DQ,Connor Price,Frisco Heritage,82.1,149.69,,,,Single-ply,SBD,M
Boys,82.1,DQ,Robert Merryfield,Frisco Heritage,77.2,,,,,Single-ply,SBD,M
Boys,82.1,DQ,Conner Crane,Frisco Wakeland,75.8,147.42,83.91,156.49,,Single-ply,SBD,M
Boys,82.1,DQ,Kenneth Whittaker,Frisco Liberty,79.47,,,,,Single-ply,SBD,M
Boys,82.1,DQ,Josh Garcias,Carrollton Creekview,81.6,124.74,,,,Single-ply,SBD,M
Boys,99.79,1,Aaron Bailey,Frisco Wakeland,90.04,238.14,136.08,215.46,589.67,Single-ply,SBD,M
Boys,89.81,2,Logan Matamoros,Frisco Centennial,88.41,199.58,129.27,199.58,528.44,Single-ply,SBD,M
Boys,89.81,3,Corbin Diaz,Frisco Lone Star,86.23,208.65,124.74,176.9,510.29,Single-ply,SBD,M
Boys,89.81,4,Emmitt Gott,Carrollton Creekview,83.73,181.44,108.86,195.04,485.34,Single-ply,SBD,M
Boys,89.81,5,Nick Sepper,Frisco Wakeland,89.04,181.44,108.86,181.44,471.74,Single-ply,SBD,M
Boys,89.81,6,Jm Charles,Frisco Heritage,89.81,158.76,108.86,142.88,410.5,Single-ply,SBD,M
Boys,89.81,7,Phan Tran,Frisco Lone Star,84.64,124.74,97.52,158.76,381.02,Single-ply,SBD,M
Boys,89.81,8,Ryan Holmes,Frisco Heritage,84.37,131.54,83.91,131.54,347,Single-ply,SBD,M
Boys,89.81,9,Derek Deiter,Frisco,89.81,174.63,111.13,,285.76,Single-ply,SB,M
Boys,89.81,DQ,Paine Matiscik,McKinney Boyd,83.1,,,,,Single-ply,SB,M
Boys,89.81,DQ,Adrian Williams,Carrollton Creekview,83.91,174.63,,,,Single-ply,SB,M
Boys,89.81,DQ,Cole Cantrell,Frisco Centennial,87,,,,,Single-ply,SB,M
Boys,99.79,1,Andrew Allen,Frisco Liberty,93.71,219.99,117.93,226.8,564.72,Single-ply,SBD,M
Boys,99.79,2,Derek Gourley,Frisco,97.93,174.63,138.35,188.24,501.22,Single-ply,SBD,M
Boys,99.79,3,Ryan Joyce,Frisco Centennial,96.75,197.31,122.47,172.37,492.15,Single-ply,SBD,M
Boys,99.79,4,Tyler Carver,Frisco Wakeland,91.31,174.63,115.67,170.1,460.4,Single-ply,SBD,M
Boys,99.79,5,Chris Maxey,Carrollton Creekview,92.22,167.83,106.59,136.08,410.5,Single-ply,SBD,M
Boys,99.79,6,Lohit Adusumilli,Frisco Heritage,97.48,115.67,74.84,124.74,315.25,Single-ply,SBD,M
Boys,99.79,7,Frank Boudreaux,Plano John Paul II,94.08,81.65,65.77,142.88,290.3,Single-ply,SBD,M
Boys,99.79,DQ,Tomas O'Toole Halverson,Plano John Paul II,92.03,,,,,Single-ply,SBD,M
Boys,109.77,1,Adam Borne,Frisco Liberty,100.29,217.72,136.08,208.65,562.45,Single-ply,SBD,M
Boys,109.77,2,Kyle Flowers,Frisco Wakeland,104.73,222.26,140.61,197.31,560.19,Single-ply,SBD,M
Boys,124.74,3,Jeremy Seligsohn,Frisco Wakeland,109.91,222.26,106.59,192.78,521.63,Single-ply,SBD,M
Boys,109.77,4,Alex Nguyen,Frisco,102.42,204.12,113.4,172.37,489.88,Single-ply,SBD,M
Boys,109.77,5,Kevin Smith,Frisco Centennial,107.73,172.37,124.74,174.63,471.74,Single-ply,SBD,M
Boys,109.77,6,Drew Percle,Frisco Liberty,108.59,181.44,120.2,165.56,467.2,Single-ply,SBD,M
Boys,109.77,7,Dalton Soullas,Frisco Centennial,102.69,185.97,108.86,158.76,453.59,Single-ply,SBD,M
Boys,109.77,8,Jeff Forst,Frisco Heritage,107.82,161.03,77.11,149.69,387.82,Single-ply,SBD,M
Boys,109.77,DQ,Elie Nabushosi,Frisco Heritage,109.77,,,,,Single-ply,SBD,M
Boys,109.77,DQ,Austin Buch,Plano John Paul II,102.78,,,,,Single-ply,SBD,M
Boys,124.74+,1,Chase Appleby,Frisco Centennial,124.96,294.84,147.42,215.46,657.71,Single-ply,SBD,M
Boys,124.74,2,Tai Nguyen,Frisco,121.52,251.74,149.69,204.12,605.55,Single-ply,SBD,M
Boys,124.74,3,Kyle Boren,Frisco,114.49,199.58,122.47,204.12,526.17,Single-ply,SBD,M
Boys,124.74,4,Kyle McKinney,Frisco,120.93,183.7,122.47,167.83,474,Single-ply,SBD,M
Boys,124.74,5,Cord Stahl,Plano John Paul II,113.49,108.86,77.11,142.88,328.85,Single-ply,SBD,M
Boys,124.74,DQ,Mike Williams,Frisco Heritage,112.76,142.88,,,,Single-ply,SBD,M
Boys,124.74,DQ,John Archolecas,Frisco Heritage,124.74,,,,,Single-ply,SBD,M
Boys,124.74,DQ,Tyler Lewis,Carrollton Creekview,121.52,188.24,,,,Single-ply,SBD,M
Boys,124.74+,1,Arnold DeLaCruz,Carrollton Creekview,130.95,224.53,151.95,210.92,587.4,Single-ply,SBD,M
Boys,124.74+,2,Yanko Kovachev,Carrollton Creekview,134.04,219.99,127.01,181.44,528.44,Single-ply,SBD,M
Boys,124.74+,3,Matt Holmes,Frisco Centennial,132.63,204.12,136.08,181.44,521.63,Single-ply,SBD,M
