Place,Name,CyrillicName,BirthYear,WeightClassKg,Sex,BodyweightKg,Best3SquatKg,Best3BenchKg,Best3DeadliftKg,TotalKg,Event,Equipment,Division
1,Yuliya Kovzalova,Юлия Ковзалова,1982,48,F,47.35,150,77.5,145,372.5,SBD,Single-ply,Open
2,Nina Moroz,Нина Мороз,1991,48,F,47.85,120,75,115,310,SBD,Single-ply,Open
3,Olga Markushina,Ольга Маркушина,1988,48,F,46.5,112.5,55,115,282.5,SBD,Single-ply,Open
4,Anna Elesina,Анна Елесина,1985,48,F,47.05,95,50,110,255,SBD,Single-ply,Open
5,Svetlana Anoshina,Светлана Аношина,1981,48,F,41.3,87.5,55,97.5,240,SBD,Single-ply,Open
6,Aleksandra Churkina,Александра Чуркина,1992,48,F,45.8,100,45,95,240,SBD,Single-ply,Open
1,Anzhela Mkhitarova,Анжела Мхитарова,1975,52,F,51.7,120,80,132.5,332.5,SBD,Single-ply,Open
2,Maria Dubenskaya,Мария Дубенская,1988,52,F,51.4,127.5,75,127.5,330,SBD,Single-ply,Open
3,Olga Malikova,Ольга Маликова,1982,52,F,52,135,65,130,330,SBD,Single-ply,Open
4,Mariya Kolesnikova,Мария Колесникова,1992,52,F,51.4,130,65,120,315,SBD,Single-ply,Open
5,Olga Alyabeva,Ольга Алябьева,1984,52,F,51.4,115,65,135,315,SBD,Single-ply,Open
6,Ekaterina Androsova,Екатерина Андросова,1991,52,F,51.3,120,65,105,290,SBD,Single-ply,Open
7,Tatyana Somova,Татьяна Сомова,1981,52,F,49.9,95,55,110,260,SBD,Single-ply,Open
1,Natalya Kolesnikova,Наталия Колесникова,1971,56,F,55.2,160,85,155,400,SBD,Single-ply,Open
2,Ekaterina Efimova,Екатерина Ефимова,1982,56,F,56,142.5,70,135,347.5,SBD,Single-ply,Open
3,Ekaterina Grigoreva,Екатерина Григорьева,1991,56,F,54.8,137.5,65,115,317.5,SBD,Single-ply,Open
4,Tatyana Kulago,Татьяна Кулаго,1992,56,F,54.95,110,55,95,260,SBD,Single-ply,Open
1,Natalya Seryogina,Наталья Серёгина,1979,60,F,59.4,177.5,87.5,165,430,SBD,Single-ply,Open
2,Alla Chukhonastova,Алла Чухонастова,1974,60,F,57.55,150,87.5,165,402.5,SBD,Single-ply,Open
3,Valeriya Lyovochkina,Валерия Лёвочкина,1964,60,F,59.3,157.5,80,152.5,390,SBD,Single-ply,Open
4,Lidiya Chukhonastova,Лидия Чухонастова,1993,60,F,58.7,135,70,135,340,SBD,Single-ply,Open
5,Nadezhda Vasilenko,Надежда Василенко,1989,60,F,59.2,125,70,140,335,SBD,Single-ply,Open
6,Ekaterina Kotova,Екатерина Котова,1993,60,F,58.45,125,60,115,300,SBD,Single-ply,Open
DQ,Oksana Ilyushchenko,Оксана Илющенко,1993,60,F,58.4,120,,,,SBD,Single-ply,Open
1,Mariya Gulidova,Мария Гулидова,1989,67.5,F,66.3,215,130,190,535,SBD,Single-ply,Open
2,Yuliya Pilipchatina,Юлия Пилипчатина,1984,67.5,F,64.25,180,75,160,415,SBD,Single-ply,Open
3,Natalya Alekseeva,Наталья Алексеева,1983,67.5,F,66.65,155,85,155,395,SBD,Single-ply,Open
4,Narine Arushanova,Наринэ Арушанова,1991,67.5,F,63.25,150,75,147.5,372.5,SBD,Single-ply,Open
5,Galina Pylyova,Галина Пылёва,1987,67.5,F,66.8,145,72.5,145,362.5,SBD,Single-ply,Open
6,Alla Dubrovskaya,Алла Дубровская,1981,67.5,F,67.35,140,75,140,355,SBD,Single-ply,Open
1,Olga Pantina,Ольга Пантина,1979,75,F,68.65,230,130,185,545,SBD,Single-ply,Open
2,Alla Tishina,Алла Тишина,1961,75,F,74.25,195,95,190,480,SBD,Single-ply,Open
3,Evgeniya Dukachyova,Евгения Дукачёва,1983,75,F,71.3,192.5,100,185,477.5,SBD,Single-ply,Open
4,Lyudmila Chechulina,Людмила Чечулина,1984,75,F,71.4,192.5,95,177.5,465,SBD,Single-ply,Open
1,Lyudmila Roshchina,Людмила Рощина,1983,82.5,F,75.4,180,95,162.5,437.5,SBD,Single-ply,Open
2,Evgeniya Boldakova,Евгения Болдакова,1988,82.5,F,75.5,145,72.5,137.5,355,SBD,Single-ply,Open
1,Larisa Osadko,Лариса Осадько,1977,90,F,89.25,155,105,160,420,SBD,Single-ply,Open
1,Lyudmila Laushkina,Людмила Лаушкина,1977,90+,F,125.05,160,90,160,410,SBD,Single-ply,Open
1,Nikolay Aksenov,Николай Аксёнов,1957,56,M,55.2,180,95,190,465,SBD,Single-ply,Open
2,Dmitriy Pankrushev,Дмитрий Панкрушев,1987,56,M,54.55,172.5,117.5,165,455,SBD,Single-ply,Open
3,Maksim Yudin,Максим Юдин,1980,56,M,55.1,177.5,95,170,442.5,SBD,Single-ply,Open
4,Aleksandr Martirosyan,Александр Мартиросян,1990,56,M,55.1,175,82.5,172.5,430,SBD,Single-ply,Open
5,Aleksey Savchenko,Алексей Савченко,1992,56,M,54.4,125,100,145,370,SBD,Single-ply,Open
DQ,Aleksandr Melnikov,Александр Мельников,1989,56,M,55.2,175,110,,,SBD,Single-ply,Open
1,Vitaliy Skoropad,Виталий Скоропад,1986,60,M,59.95,207.5,130,217.5,555,SBD,Single-ply,Open
2,Roman Pastukhov,Роман Пастухов,1980,60,M,58.35,215,105,202.5,522.5,SBD,Single-ply,Open
3,Denis Smyslin,Денис Смыслин,1990,60,M,58.75,185,120,195,500,SBD,Single-ply,Open
DQ,Andrey Nikitin,Андрей Никитин,1982,60,M,59.95,,,,,SBD,Single-ply,Open
1,Aleksandr Ivashnyov,Александр Ивашнёв,1985,67.5,M,67,280,170,245,695,SBD,Single-ply,Open
2,Mikhail Penkov,Михаил Пеньков,1983,67.5,M,63.7,255,165,245,665,SBD,Single-ply,Open
3,Ivan Nesterov,Иван Нестеров,1988,67.5,M,66.9,260,130,257.5,647.5,SBD,Single-ply,Open
4,Roman Stupnikov,Роман Ступников,1988,67.5,M,66.9,245,135,255,635,SBD,Single-ply,Open
5,Nikolay Zhukov,Николай Жуков,1987,67.5,M,67.25,225,140,240,605,SBD,Single-ply,Open
6,Dmitriy Markin,Дмитрий Маркин,1989,67.5,M,66.25,250,130,210,590,SBD,Single-ply,Open
7,Aleksey Zdorikov,Алексей Здориков,1991,67.5,M,66.7,240,145,200,585,SBD,Single-ply,Open
8,Igor Lyubaev,Игорь Любаев,1979,67.5,M,64.5,230,130,210,570,SBD,Single-ply,Open
9,Roman Chestnykh,Роман Честных,1981,67.5,M,67.3,215,145,210,570,SBD,Single-ply,Open
10,Vadim Mitin,Вадим Митин,1988,67.5,M,66.7,215,110,195,520,SBD,Single-ply,Open
11,Andrey Smyshlyaev,Андрей Смышляев,1991,67.5,M,67.3,200,95,220,515,SBD,Single-ply,Open
12,Vladimir Mitryakhin,Владимир Митряхин,1986,67.5,M,64.85,180,115,200,495,SBD,Single-ply,Open
1,Aleksandr Penkov,Александр Пеньков,1986,75,M,67.55,312.5,190,270,772.5,SBD,Single-ply,Open
2,Aleksandr Bykov,Александр Быков,1982,75,M,74.4,295,175,285,755,SBD,Single-ply,Open
3,Sergey Vlaznev,Сергей Влазнев,1977,75,M,74.8,280,215,240,735,SBD,Single-ply,Open
4,Suliman Musovstov,Сулиман Мусовстов,1982,75,M,75,250,190,270,710,SBD,Single-ply,Open
5,Sergey Lugovoy,Сергей Луговой,1981,75,M,73.45,270,190,240,700,SBD,Single-ply,Open
6,Bakhtiyar Abdukerimov,Бахтияр Абдукеримов,1989,75,M,74.7,265,150,265,680,SBD,Single-ply,Open
7,Vyacheslav Leonov,Вячеслав Леонов,1984,75,M,73.9,260,165,250,675,SBD,Single-ply,Open
8,Vyacheslav Semerich,Вячеслав Семерич,1984,75,M,74.2,270,140,250,660,SBD,Single-ply,Open
9,Denis Sapozhnikov,Денис Сапожников,1985,75,M,74.45,250,165,235,650,SBD,Single-ply,Open
10,Aleksey Korchagin,Алексей Корчагин,1978,75,M,74.95,230,185,230,645,SBD,Single-ply,Open
11,Boris Khovrakh,Борис Ховрах,1986,75,M,74.85,265,167.5,210,642.5,SBD,Single-ply,Open
12,Pavel Bondarenko,Павел Бондаренко,1986,75,M,74.3,250,150,240,640,SBD,Single-ply,Open
13,Vladimir Urazov,Владимир Уразов,1967,75,M,73.2,242.5,145,240,627.5,SBD,Single-ply,Open
14,Pyotr Aldoshin,Пётр Алдошин,1983,75,M,74.55,240,162.5,220,622.5,SBD,Single-ply,Open
15,Andrey Ilin,Андрей Ильин,1991,75,M,74.45,255,110,240,605,SBD,Single-ply,Open
16,Aleksey Otrubyannikov,Алексей Отрубянников,1986,75,M,75,245,135,225,605,SBD,Single-ply,Open
17,Nikita Saltykov,Никита Салтыков,1989,75,M,74.4,235,150,210,595,SBD,Single-ply,Open
18,Aleksandr Alpeev,Александр Алпеев,1990,75,M,68.05,190,105,160,455,SBD,Single-ply,Open
DQ,Igor Sitko,Игорь Ситько,1987,75,M,75,245,,,,SBD,Single-ply,Open
1,Gennadiy Eryomin,Геннадий Ерёмин,1973,82.5,M,82.3,335,240,300,875,SBD,Single-ply,Open
2,Kakhramon Shoberdiev,Кахрамон Шобердиев,1984,82.5,M,81.95,300,180,320,800,SBD,Single-ply,Open
3,Ivan Fedotov,Иван Федотов,1986,82.5,M,78.8,315,212.5,265,792.5,SBD,Single-ply,Open
4,Aleksey Krivonogov,Алексей Кривоногов,1980,82.5,M,81.8,310,187.5,272.5,770,SBD,Single-ply,Open
5,Evgeniy Korotchenkov,Евгений Коротченков,1988,82.5,M,81.95,320,197.5,252.5,770,SBD,Single-ply,Open
6,Gleb Kolganov,Глеб Колганов,1987,82.5,M,81.9,285,210,250,745,SBD,Single-ply,Open
7,Evgeniy Nikolaev,Евгений Николаев,1985,82.5,M,82.45,272.5,177.5,270,720,SBD,Single-ply,Open
8,Aleksandr Vasilkov,Александр Васильков,1985,82.5,M,81.95,285,160,265,710,SBD,Single-ply,Open
9,Roman Gavrilov #1,Роман Гаврилов,1988,82.5,M,82.25,300,150,260,710,SBD,Single-ply,Open
10,Andrey Kildyushev,Андрей Кильдюшев,1988,82.5,M,82.05,260,190,240,690,SBD,Single-ply,Open
11,Denis Shilenko,Денис Шиленко,1983,82.5,M,81.3,270,170,245,685,SBD,Single-ply,Open
12,Denis Bolychev,Денис Болычев,1983,82.5,M,81.9,240,162.5,270,672.5,SBD,Single-ply,Open
13,Aleksandr Poddubnik,Александр Поддубник,1981,82.5,M,81.4,250,170,230,650,SBD,Single-ply,Open
14,Nikolay Taushev,Николай Таушев,1987,82.5,M,82.25,250,135,250,635,SBD,Single-ply,Open
DQ,Ivan Dmitriev,Иван Дмитриев,1970,82.5,M,82.4,297.5,195,,,SBD,Single-ply,Open
1,Yuriy Seleznyov,Юрий Селезнёв,1979,90,M,90,332.5,230,267.5,830,SBD,Single-ply,Open
2,Vladimir Pronin,Владимир Пронин,1983,90,M,90,330,200,292.5,822.5,SBD,Single-ply,Open
3,Vladimir Zhabin,Владимир Жабин,1980,90,M,87.55,305,212.5,287.5,805,SBD,Single-ply,Open
4,Khozh-Akhmed Eldarov,Хож-Ахмед Эльдаров,1983,90,M,88.85,345,175,285,805,SBD,Single-ply,Open
5,Aleksey Mershchikov,Алексей Мерщиков,1983,90,M,89.25,315,202.5,282.5,800,SBD,Single-ply,Open
6,Kasim Timurkaev,Касим Тимуркаев,1983,90,M,89.95,300,220,275,795,SBD,Single-ply,Open
7,Andrey Tikhonov,Андрей Тихонов,1983,90,M,89.85,300,200,290,790,SBD,Single-ply,Open
8,Sergey Matveev,Сергей Матвеев,1980,90,M,88.9,300,200,270,770,SBD,Single-ply,Open
9,Vladimir Mkhitarov,Владимир Мхитаров,1985,90,M,89.75,300,200,260,760,SBD,Single-ply,Open
10,Denis Rodyakin,Денис Родякин,1988,90,M,89.5,315,170,270,755,SBD,Single-ply,Open
11,Nikolay Volovikov,Николай Воловиков,1988,90,M,90,280,177.5,292.5,750,SBD,Single-ply,Open
12,Stanislav Vishnyakov,Станислав Вишняков,1976,90,M,90,280,185,280,745,SBD,Single-ply,Open
13,Dmitriy Soldatov,Дмитрий Солдатов,1985,90,M,89.65,290,162.5,280,732.5,SBD,Single-ply,Open
14,Ivan Klimenkov,Иван Клименков,1985,90,M,89.15,290,165,270,725,SBD,Single-ply,Open
15,Sergey Natalchenko,Сергей Натальченко,1983,90,M,90,290,165,270,725,SBD,Single-ply,Open
16,Maksim Korostelev,Максим Коростелев,1984,90,M,89.25,295,145,280,720,SBD,Single-ply,Open
17,Dmitriy Ostapenko,Дмитрий Остапенко,1986,90,M,86.6,260,190,230,680,SBD,Single-ply,Open
18,Yaroslav Yakushev,Ярослав Якушев,1985,90,M,88.35,220,190,240,650,SBD,Single-ply,Open
19,Evgeniy Nikulin,Евгений Никулин,1990,90,M,89.6,250,145,255,650,SBD,Single-ply,Open
21,Evgeniy Nesterov,Евгений Нестеров,1988,90,M,88,260,140,225,625,SBD,Single-ply,Open
22,Mikhail Kalinin,Михаил Калинин,1975,90,M,88.75,215,145,230,590,SBD,Single-ply,Open
DQ,Dmitriy Konorev,Дмитрий Конорев,1987,90,M,88.75,280,,,,SBD,Single-ply,Open
DQ,Egor Chernovolov,Егор Черноволов,1986,90,M,89.95,,,,,SBD,Single-ply,Open
1,Vitaliy Bobrov,Виталий Бобров,1981,100,M,96.75,372.5,230,310,912.5,SBD,Single-ply,Open
2,Konstantin Ratnieks,Константин Ратниекс,1980,100,M,98.15,345,212.5,300,857.5,SBD,Single-ply,Open
3,Andrey Gornostaev,Андрей Горностаев,1977,100,M,94.85,320,195,310,825,SBD,Single-ply,Open
4,Anton Rybakov,Антон Рыбаков,1980,100,M,99.55,325,230,270,825,SBD,Single-ply,Open
5,Andrey Pestunov,Андрей Пестунов,1985,100,M,99.4,320,200,300,820,SBD,Single-ply,Open
6,Aleksey Suchilin,Алексей Сучилин,1980,100,M,99.8,320,190,300,810,SBD,Single-ply,Open
7,Anton Kamov,Антон Камов,1973,100,M,95.55,310,185,305,800,SBD,Single-ply,Open
8,Dmitriy Badabash,Дмитрий Бадабаш,1984,100,M,98.2,300,222.5,275,797.5,SBD,Single-ply,Open
9,Artyom Kiselyov,Артём Киселёв,1977,100,M,98.55,315,210,270,795,SBD,Single-ply,Open
10,Adler Mityaev,Адлер Митяев,1981,100,M,90.3,310,202.5,280,792.5,SBD,Single-ply,Open
11,Maksim Grigorev,Максим Григорьев,1979,100,M,97.6,330,200,250,780,SBD,Single-ply,Open
12,Denis Toropynin,Денис Торопынин,1984,100,M,91.9,312.5,175,290,777.5,SBD,Single-ply,Open
13,Stanislav Dubrovin,Станислав Дубровин,1984,100,M,94.45,300,195,280,775,SBD,Single-ply,Open
14,Ivan Prokopenko,Иван Прокопенко,1983,100,M,98.95,285,210,280,775,SBD,Single-ply,Open
15,Aleksandr Mastin,Александр Мастин,1984,100,M,99.9,300,205,270,775,SBD,Single-ply,Open
16,Igor Evdokimov,Игорь Евдокимов,1984,100,M,97.95,300,185,270,755,SBD,Single-ply,Open
17,Leonid Golyatskiy,Леонид Голяцкий,1980,100,M,92.6,260,205,260,725,SBD,Single-ply,Open
18,Anton Bullo,Антон Булло,1987,100,M,92.1,270,170,260,700,SBD,Single-ply,Open
19,Artur Yantsen,Артур Янцен,1987,100,M,93.2,270,150,210,630,SBD,Single-ply,Open
DQ,Timir-Bulat Magomadov,Тимир-Булат Магомадов,1976,100,M,97.6,330,210,,,SBD,Single-ply,Open
DQ,Aleksandr Glushakov,Александр Глушаков,1979,100,M,,,,,,SBD,Single-ply,Open
DQ,Karlen Osipov,Карлен Осипов,1972,100,M,,,,,,SBD,Single-ply,Open
1,Andrey Shurbenkov,Андрей Шурбенков,1979,110,M,106.55,360,250,330,940,SBD,Single-ply,Open
2,Nikolay Shylo,Николай Шыло,1987,110,M,104.1,350,225,290,865,SBD,Single-ply,Open
3,Sergey Petrushin,Сергей Петрушин,1981,110,M,109.5,340,225,290,855,SBD,Single-ply,Open
4,Mikhail Trunov,Михаил Трунов,1985,110,M,104.15,340,205,300,845,SBD,Single-ply,Open
5,Renad Akhmetov,Ренад Ахметов,1961,110,M,106.05,310,225,305,840,SBD,Single-ply,Open
6,Roman Romanov,Роман Романов,1982,110,M,109.8,350,190,300,840,SBD,Single-ply,Open
7,Sergey Danelenkov,Сергей Данеленков,1980,110,M,108.4,310,225,280,815,SBD,Single-ply,Open
8,Sergey Khovryakov,Сергей Ховряков,1986,110,M,105.85,317.5,185,300,802.5,SBD,Single-ply,Open
9,Dmitriy Dolgov,Дмитрий Долгов,1986,110,M,105.75,310,200,290,800,SBD,Single-ply,Open
10,Aleksandr Yurchenko,Александр Юрченко,1986,110,M,105.6,315,205,275,795,SBD,Single-ply,Open
11,Sergey Nasedkin,Сергей Наседкин,1973,110,M,108.15,300,210,285,795,SBD,Single-ply,Open
12,Dmitriy Mironov,Дмитрий Миронов,1987,110,M,105.55,300,182.5,300,782.5,SBD,Single-ply,Open
13,Vladimir Gurov,Владимир Гуров,1978,110,M,106.45,290,220,270,780,SBD,Single-ply,Open
14,Aleksandr Chervyakov,Александр Червяков,1988,110,M,106.3,275,195,305,775,SBD,Single-ply,Open
15,Evgeniy Pertsev,Евгений Перцев,1981,110,M,105.1,320,180,265,765,SBD,Single-ply,Open
16,Evgeniy Teplyakov,Евгений Тепляков,1983,110,M,108.7,300,180,270,750,SBD,Single-ply,Open
17,Dmitriy Zaytsev,Дмитрий Зайцев,1978,110,M,105.05,230,155,270,655,SBD,Single-ply,Open
DQ,Artyom Prokopov,Артём Прокопов,1976,110,M,109.05,290,,,,SBD,Single-ply,Open
DQ,Murad Gadzhiev,Мурад Гаджиев,1983,110,M,107.05,355,,,,SBD,Single-ply,Open
1,Aleksandr Drogobuzhev,Александр Дрогобужев,1975,125,M,118.75,400,280,355,1035,SBD,Single-ply,Open
2,Konstantin Shevelev,Константин Шевелев,1978,125,M,122.25,390,240,370,1000,SBD,Single-ply,Open
3,Tamerlan Bashkhadzhiev,Тамерлан Башхаджиев,1978,125,M,116.3,370,240,350,960,SBD,Single-ply,Open
4,Vladimir Gavrin,Владимир Гаврин,1974,125,M,116.1,370,255,285,910,SBD,Single-ply,Open
5,Aleksandr Zagorulko,Александр Загорулько,1985,125,M,118.55,290,210,330,830,SBD,Single-ply,Open
6,Vladimir Fedorin,Владимир Федорин,1962,125,M,119.3,327.5,220,262.5,810,SBD,Single-ply,Open
7,Vasiliy Bordyuzhenko,Василий Бордюженко,1984,125,M,114.6,300,210,270,780,SBD,Single-ply,Open
8,Konstantin Fedosov,Константин Федосов,1987,125,M,115.8,300,200,250,750,SBD,Single-ply,Open
9,Denis Shtokolov,Денис Штоколов,1979,125,M,115.85,285,180,260,725,SBD,Single-ply,Open
DQ,Roman Khabarov,Роман Хабаров,1972,125,M,124,290,,,,SBD,Single-ply,Open
1,Dzhalavdi Adkhalimov,Джалавди Адхалимов,1961,125+,M,149.25,385,240,320,945,SBD,Single-ply,Open
2,Aleksandr Zaytsev,Александр Зайцев,1978,125+,M,132.35,350,210,275,835,SBD,Single-ply,Open
3,Rustam Mizaev,Рустам Мизаев,1980,125+,M,132.05,320,205,270,795,SBD,Single-ply,Open
DQ,Sergey Mateyko,Сергей Матейко,1983,125+,M,145,330,225,,,SBD,Single-ply,Open
DQ,Vyacheslav Zelenov,Вячеслав Зеленов,1965,125+,M,125.1,370,,,,SBD,Single-ply,Open
