Division,WeightClassKg,Place,Name,Team,BodyweightKg,Best3SquatKg,Best3BenchKg,Best3DeadliftKg,TotalKg,Equipment,Event,Sex
Boys,55.79,1,Ricky Fonseca,Laredo United,51.89,131.54,65.77,138.35,335.66,Single-ply,SBD,M
Boys,51.71,2,Eli Torres,Laredo Nixon,43,104.33,49.9,113.4,267.62,Single-ply,SBD,M
Boys,55.79,DQ,Jerry Alaniz,Laredo Alexander,51.89,108.86,,,,Single-ply,SBD,M
Boys,59.87,1,Cesar Alfaro,Laredo United South,55.97,124.74,70.31,142.88,337.93,Single-ply,SBD,M
Boys,55.79,2,Israel Granados,Laredo Nixon,55.34,102.06,56.7,124.74,283.5,Single-ply,SBD,M
Boys,55.79,3,Arturo Escoto,Roma,54.98,92.99,61.23,124.74,278.96,Single-ply,SBD,M
Boys,55.79,4,Rudy Davila,Laredo United,52.71,90.72,58.97,127.01,276.69,Single-ply,SBD,M
Boys,55.79,5,Francisco Garza,Roma,55.25,97.52,56.7,117.93,272.16,Single-ply,SBD,M
Boys,59.87,1,David Lopez,Laredo United South,58.42,120.2,83.91,142.88,347,Single-ply,SBD,M
Boys,59.87,2,Brian Lopez,Laredo United South,59.87,113.4,74.84,145.15,333.39,Single-ply,SBD,M
Boys,59.87,3,Victor Lopez,Roma,59.06,124.74,56.7,136.08,317.51,Single-ply,SBD,M
Boys,59.87,4,Dago Maldonado,Laredo United,59.15,124.74,54.43,131.54,310.71,Single-ply,SBD,M
Boys,59.87,5,Ismael Madrigal,Laredo United South,59.78,102.06,56.7,142.88,301.64,Single-ply,SBD,M
Boys,59.87,6,Victor Segura,Laredo Nixon,59.6,104.33,56.7,122.47,283.5,Single-ply,SBD,M
Boys,59.87,7,Arnold Pineda,Laredo Johnson,59.42,102.06,63.5,108.86,274.42,Single-ply,SBD,M
Boys,59.87,8,Clemente De Luna,Laredo Alexander,58.97,88.45,61.23,113.4,263.08,Single-ply,SBD,M
Boys,67.13,1,Luis Castillo,Laredo United South,60.78,142.88,95.25,154.22,392.36,Single-ply,SBD,M
Boys,67.13,2,Jorge Silva,Laredo Nixon,65.77,133.81,74.84,165.56,374.21,Single-ply,SBD,M
Boys,67.13,3,Xavier Skaggs,Laredo Alexander,64.5,124.74,79.38,165.56,369.68,Single-ply,SBD,M
Boys,67.13,4,Felipe Hernández,Laredo United South,64.5,138.35,77.11,142.88,358.34,Single-ply,SBD,M
Boys,67.13,5,Peter Cavazos,Laredo Nixon,65.86,124.74,63.5,149.69,337.93,Single-ply,SBD,M
Boys,67.13,6,Frank Sauceda,Laredo Alexander,64.41,108.86,61.23,165.56,335.66,Single-ply,SBD,M
Boys,67.13,7,Miguel Torres,Laredo United,61.87,127.01,61.23,124.74,312.98,Single-ply,SBD,M
Boys,67.13,8,Jon Ramos,Laredo Johnson,65.5,113.4,61.23,120.2,294.84,Single-ply,SBD,M
Boys,67.13,9,Jesus Contreras,Laredo Johnson,61.42,90.72,70.31,127.01,288.03,Single-ply,SBD,M
Boys,67.13,10,Martin Benavides,Bruni,62.69,83.91,58.97,133.81,276.69,Single-ply,SBD,M
Boys,74.84,1,Jesus Perez,Laredo Nixon,74.75,145.15,63.5,181.44,390.09,Single-ply,SBD,M
Boys,74.84,2,Eric Mcguire,Laredo United,73.48,142.88,74.84,161.03,378.75,Single-ply,SBD,M
Boys,74.84,3,Arturo Delgado,Laredo United,68.76,131.54,65.77,154.22,351.53,Single-ply,SBD,M
Boys,74.84,4,Roger Moreno,Laredo United,71.03,127.01,61.23,136.08,324.32,Single-ply,SBD,M
Boys,74.84,5,Robert Alaniz,Roma,72.12,102.06,65.77,136.08,303.91,Single-ply,SBD,M
Boys,74.84,6,Josue Barrera,Laredo Johnson,73.84,90.72,70.31,129.27,290.3,Single-ply,SBD,M
Boys,82.1,1,Jose Herrera,Laredo United,80.83,181.44,86.18,185.97,453.59,Single-ply,SBD,M
Boys,82.1,2,David Villagran,Laredo United South,77.75,170.1,83.91,161.03,415.04,Single-ply,SBD,M
Boys,82.1,3,Oscar Mohamed,Laredo United,80.1,133.81,102.06,154.22,390.09,Single-ply,SBD,M
Boys,82.1,4,Jose Hernandez,Laredo Nixon,80.29,117.93,70.31,188.24,376.48,Single-ply,SBD,M
Boys,82.1,5,Julio Cruz,Bruni,76.66,142.88,72.57,149.69,365.14,Single-ply,SBD,M
Boys,82.1,DQ,Andrew Walker,Laredo Johnson,80.1,,,,,Single-ply,SBD,M
Boys,89.81,1,Robert Rodriguez,Laredo Nixon,85.82,165.56,111.13,179.17,455.86,Single-ply,SBD,M
Boys,89.81,2,Gabriel Rodriguez,Laredo Alexander,88.09,124.74,88.45,183.7,396.89,Single-ply,SBD,M
Boys,89.81,3,Maylin Blanco,Laredo Johnson,85.64,113.4,72.57,158.76,344.73,Single-ply,SBD,M
Boys,89.81,4,Homar Ochoa,Roma,87.82,136.08,72.57,133.81,342.46,Single-ply,SBD,M
Boys,89.81,5,Eloy Sauceda,Laredo Alexander,85.55,92.99,68.04,158.76,319.78,Single-ply,SBD,M
Boys,99.79,1,Erick Fernandez,Laredo Nixon,98.97,176.9,122.47,201.85,501.22,Single-ply,SBD,M
Boys,109.77,2,Ricky Martinez,Laredo United,99.97,204.12,106.59,165.56,476.27,Single-ply,SBD,M
Boys,99.79,3,Christian Rosas,Laredo Alexander,97.43,158.76,108.86,183.7,451.32,Single-ply,SBD,M
Boys,99.79,4,Mateo Villarreal,Laredo Nixon,97.43,154.22,79.38,188.24,421.84,Single-ply,SBD,M
Boys,99.79,5,Edgar Martinez,Laredo United South,90.99,136.08,81.65,156.49,374.21,Single-ply,SBD,M
Boys,99.79,6,Oscar Nava,Roma,97.52,156.49,83.91,133.81,374.21,Single-ply,SBD,M
Boys,109.77,1,Omar Ramirez,Roma,104.24,197.31,108.86,213.19,519.36,Single-ply,SBD,M
Boys,109.77,2,Alex De Luna,Laredo United South,109.13,183.7,74.84,181.44,439.98,Single-ply,SBD,M
Boys,109.77,3,Frank Villareal,Laredo Martin,107.41,136.08,92.99,158.76,387.82,Single-ply,SBD,M
Boys,109.77,4,Aaron Tijerina,Laredo United,103.28,147.42,81.65,140.61,369.68,Single-ply,SBD,M
Boys,124.74,1,Eliud Aguero,Laredo Alexander,124.74,240.4,151.95,247.21,639.57,Single-ply,SBD,M
Boys,124.74,2,Edgar Arispe,Laredo Johnson,119.57,167.83,95.25,192.78,455.86,Single-ply,SBD,M
Boys,124.74,3,Jesus Lopez,Laredo Johnson,113.31,161.03,95.25,174.63,430.91,Single-ply,SBD,M
Boys,124.74,4,Freddy Romo,Laredo Alexander,117.48,127.01,90.72,158.76,376.48,Single-ply,SBD,M
Boys,124.74+,1,Alexis Manrique,Laredo United,126.1,158.76,102.06,176.9,437.72,Single-ply,SBD,M
Boys,124.74+,2,Gerardo Urdiales,Laredo Nixon,125.19,172.37,81.65,172.37,426.38,Single-ply,SBD,M
Boys,124.74+,3,John Bernal,Laredo United South,132.81,183.7,68.04,172.37,424.11,Single-ply,SBD,M
Boys,124.74+,4,Juan Moreno,Roma,126.73,161.03,92.99,165.56,419.57,Single-ply,SBD,M
Boys,124.74+,5,Chapa Jacob,Bruni,128.46,158.76,77.11,138.35,374.21,Single-ply,SBD,M
