Division,WeightClassKg,Place,Name,Team,BodyweightKg,Best3SquatKg,Best3BenchKg,Best3DeadliftKg,TotalKg,Equipment,Event,Sex
Boys,51.71,1,Jose Sanchez,Gilmer,50.44,167.83,99.79,163.29,430.91,Single-ply,SBD,M
Boys,51.71,2,Zach Tompkins,Mount Vernon,51.71,83.91,54.43,111.13,249.48,Single-ply,SBD,M
Boys,55.79,1,Cody Maxie,Atlanta,55.43,131.54,65.77,131.54,328.85,Single-ply,SBD,M
Boys,55.79,2,Sir Charles Johnson,Jefferson,54.98,83.91,54.43,111.13,249.48,Single-ply,SBD,M
Boys,59.87,1,Patrick Dreesen,Linden-Kildare,58.69,167.83,77.11,158.76,403.7,Single-ply,SBD,M
Boys,59.87,2,Walter Jones,Laird Hill Leveretts Chapel,59.78,147.42,83.91,136.08,367.41,Single-ply,SBD,M
Boys,59.87,3,Jabier Bocanegra,Gilmer,58.88,142.88,72.57,145.15,360.61,Single-ply,SBD,M
Boys,59.87,4,Karson Bynum,Linden-Kildare,56.7,120.2,72.57,131.54,324.32,Single-ply,SBD,M
Boys,59.87,5,Larry Chandler,Mount Vernon,59.87,102.06,61.23,124.74,288.03,Single-ply,SBD,M
Boys,59.87,DQ,Canon Chamberlain,Gladewater Union Grove,59.87,127.01,,,,Single-ply,SBD,M
Boys,67.13,1,Jason Jackson,De Kalb,66.86,201.85,113.4,192.78,508.02,Single-ply,SBD,M
Boys,67.13,2,Lukas Enloe,Gilmer,67.13,179.17,102.06,154.22,435.45,Single-ply,SBD,M
Boys,67.13,3,David Hall,Mount Enterprise,67.13,131.54,72.57,163.29,367.41,Single-ply,SBD,M
Boys,67.13,4,Deondre Doss,Diana New Diana,66.32,161.03,72.57,129.27,362.87,Single-ply,SBD,M
Boys,67.13,5,Zachariah Jefferson,Atlanta,67.04,147.42,70.31,142.88,360.61,Single-ply,SBD,M
Boys,67.13,6,Nathan Huckaby,Gladewater Union Grove,64.95,122.47,83.91,133.81,340.19,Single-ply,SBD,M
Boys,67.13,7,Colin Morris,Atlanta,62.23,113.4,79.38,136.08,328.85,Single-ply,SBD,M
Boys,67.13,8,Diego Torres,Mount Vernon,65.59,120.2,74.84,133.81,328.85,Single-ply,SBD,M
Boys,67.13,9,Jordan Prignit,Atlanta,61.6,136.08,54.43,136.08,326.59,Single-ply,SBD,M
Boys,67.13,10,Lakeceion Richardson,Atlanta,62.23,122.47,68.04,131.54,322.05,Single-ply,SBD,M
Boys,67.13,11,Corey Gage,Mount Vernon,62.96,108.86,61.23,124.74,294.84,Single-ply,SBD,M
Boys,67.13,12,Corey Vance,Mount Vernon,61.42,90.72,63.5,136.08,290.3,Single-ply,SBD,M
Boys,67.13,13,Korbin Craig,Laird Hill Leveretts Chapel,62.69,99.79,49.9,95.25,244.94,Single-ply,SBD,M
Boys,67.13,DQ,Erik Fowler,Linden-Kildare,63.23,124.74,,,,Single-ply,SBD,M
Boys,74.84,1,Sean Collins,Gilmer,67.77,224.53,120.2,188.24,532.97,Single-ply,SBD,M
Boys,74.84,2,Carson Barber,Gilmer,74.3,201.85,102.06,204.12,508.02,Single-ply,SBD,M
Boys,74.84,3,Jose Bueno,Center,74.75,204.12,111.13,188.24,503.49,Single-ply,SBD,M
Boys,74.84,4,Nathan Smith,Mount Vernon,73.48,183.7,113.4,190.51,487.61,Single-ply,SBD,M
Boys,74.84,5,Jacob Yordy,Gilmer Union Hill,73.3,163.29,79.38,190.51,433.18,Single-ply,SBD,M
Boys,74.84,6,Wes Atkison,Gladewater Union Grove,69.13,142.88,95.25,172.37,410.5,Single-ply,SBD,M
Boys,74.84,7,Trevor Lolies,Maud,72.76,154.22,86.18,158.76,399.16,Single-ply,SBD,M
Boys,74.84,8,Daniel Hamburg,Mount Vernon,69.49,120.2,77.11,136.08,333.39,Single-ply,SBD,M
Boys,74.84,9,Dawson Blear,Laird Hill Leveretts Chapel,72.76,147.42,77.11,108.86,333.39,Single-ply,SBD,M
Boys,74.84,10,Derrick Martin,Atlanta,73.48,104.33,61.23,120.2,285.76,Single-ply,SBD,M
Boys,74.84,DQ,Cameron Cox,Gilmer,74.03,181.44,108.86,,,Single-ply,SBD,M
Boys,74.84,DQ,Jaden Wilson,Diana New Diana,74.75,136.08,,,,Single-ply,SBD,M
Boys,74.84,DQ,Conner Ellis,Gladewater Union Grove,71.85,145.15,,,,Single-ply,SBD,M
Boys,74.84,DQ,Malik Cannon,Jefferson,69.58,,,,,Single-ply,SBD,M
Boys,82.1,1,Cameron Woods,Mount Vernon,80.92,219.99,111.13,226.8,557.92,Single-ply,SBD,M
Boys,82.1,2,Zane Freeman,Diana New Diana,81.56,201.85,104.33,204.12,510.29,Single-ply,SBD,M
Boys,82.1,3,Arie Love,De Kalb,79.74,181.44,97.52,170.1,449.06,Single-ply,SBD,M
Boys,82.1,4,Jordan Stiger,Atlanta,75.66,181.44,97.52,167.83,446.79,Single-ply,SBD,M
Boys,82.1,5,Dylan Kizer,De Kalb,75.21,161.03,99.79,174.63,435.45,Single-ply,SBD,M
Boys,82.1,6,Brendon Pullen,Gladewater Union Grove,80.56,147.42,99.79,158.76,405.97,Single-ply,SBD,M
Boys,82.1,7,Jeremiah Jefferson,Atlanta,81.65,170.1,79.38,154.22,403.7,Single-ply,SBD,M
Boys,82.1,8,Seth Brower,Maud,75.57,142.88,86.18,172.37,401.43,Single-ply,SBD,M
Boys,82.1,9,Jake Walker,Gilmer,77.56,145.15,83.91,145.15,374.21,Single-ply,SBD,M
Boys,89.81,1,Witt Dockens,Center,88.68,285.76,147.42,238.14,671.32,Single-ply,SBD,M
Boys,89.81,2,Aron Jahr,Diana New Diana,88.99,242.67,151.95,249.48,644.1,Single-ply,SBD,M
Boys,89.81,3,Christian Fraser,Diana New Diana,86.91,154.22,104.33,197.31,455.86,Single-ply,SBD,M
Boys,89.81,4,Gunner Fielden,Mount Vernon,87.82,142.88,97.52,192.78,433.18,Single-ply,SBD,M
Boys,89.81,5,Quentin Jackson,Clarksville,89.54,147.42,108.86,170.1,426.38,Single-ply,SBD,M
Boys,89.81,6,Brian Chavez,Clarksville,87.27,147.42,83.91,172.37,403.7,Single-ply,SBD,M
Boys,89.81,7,Ethan Lum,Simms Bowie,84.1,129.27,81.65,127.01,337.93,Single-ply,SBD,M
Boys,89.81,DQ,Zach Hooper,Simms Bowie,84.73,174.63,83.91,,,Single-ply,SBD,M
Boys,99.79,1,Katavious Evans,Center,96.89,265.35,122.47,233.6,621.42,Single-ply,SBD,M
Boys,99.79,2,Garrison McKinnie,De Kalb,99.43,215.46,142.88,206.38,564.72,Single-ply,SBD,M
Boys,99.79,3,Jacob Oswald,Mount Enterprise,94.98,190.51,165.56,199.58,555.65,Single-ply,SBD,M
Boys,99.79,4,Dakota Kizer,De Kalb,99.7,210.92,124.74,192.78,528.44,Single-ply,SBD,M
Boys,99.79,5,Bladen Collom,Gilmer,98.25,199.58,97.52,213.19,510.29,Single-ply,SBD,M
Boys,99.79,6,Jared Cowgill,Atlanta,95.8,176.9,111.13,179.17,467.2,Single-ply,SBD,M
Boys,99.79,7,Dillan Arden,Gladewater Union Grove,95.53,172.37,108.86,165.56,446.79,Single-ply,SBD,M
Boys,99.79,8,Landon Liles,Linden-Kildare,98.88,145.15,92.99,181.44,419.57,Single-ply,SBD,M
Boys,99.79,9,Caden Lambert,Diana New Diana,97.07,154.22,86.18,165.56,405.97,Single-ply,SBD,M
Boys,109.77,1,Tyler Watts,Simms Bowie,107.05,272.16,149.69,238.14,659.98,Single-ply,SBD,M
Boys,109.77,2,Logan Holloway,Center,108.86,238.14,136.08,210.92,585.13,Single-ply,SBD,M
Boys,109.77,3,Tyrell Hobbs,Clarksville,102.87,188.24,124.74,206.38,519.36,Single-ply,SBD,M
Boys,109.77,4,Drew Ezell,Gilmer,103.78,206.38,113.4,192.78,512.56,Single-ply,SBD,M
Boys,109.77,5,Chance Sprague,Maud,107.86,188.24,117.93,204.12,510.29,Single-ply,SBD,M
Boys,109.77,6,Colton Brantly,Mount Vernon,106.87,197.31,111.13,199.58,508.02,Single-ply,SBD,M
Boys,109.77,7,Jacob Humphrey,Atlanta,109.13,176.9,81.65,183.7,442.25,Single-ply,SBD,M
Boys,109.77,8,Jordan Gilberg,Gilmer,109.68,165.56,104.33,167.83,437.72,Single-ply,SBD,M
Boys,109.77,9,Connor Humphrey,Maud,102.51,170.1,102.06,158.76,430.91,Single-ply,SBD,M
Boys,109.77,10,Zevian Wilson,Linden-Kildare,106.14,142.88,97.52,163.29,403.7,Single-ply,SBD,M
Boys,109.77,DQ,Kenneth Johnson,Gladewater Union Grove,109.13,,,,,Single-ply,SBD,M
Boys,109.77,DQ,Jacob Moses,Gilmer,108.32,,,,,Single-ply,SBD,M
Boys,124.74,1,Chris Chamness,Mount Vernon,115.76,290.3,145.15,276.69,712.14,Single-ply,SBD,M
Boys,124.74,2,Matt Brunson,Diana New Diana,116.21,249.48,147.42,226.8,623.69,Single-ply,SBD,M
Boys,124.74,3,Kutter Walker,Simms Bowie,110.68,204.12,120.2,204.12,528.44,Single-ply,SBD,M
Boys,124.74,4,Rocky Cunningham,Jefferson,114.67,163.29,99.79,190.51,453.59,Single-ply,SBD,M
Boys,124.74+,1,Morgan Clark,Gladewater Union Grove,133.08,294.84,154.22,256.28,705.34,Single-ply,SBD,M
Boys,124.74+,2,Devon King,Gilmer,144.06,278.96,158.76,256.28,694,Single-ply,SBD,M
Boys,124.74+,3,Alex Sultz,Maud,131.81,272.16,151.95,238.14,662.24,Single-ply,SBD,M
Boys,124.74+,4,Lucas Stephenson,Simms Bowie,129.82,294.84,138.35,226.8,659.98,Single-ply,SBD,M
Boys,124.74+,5,Austin Terry,Gilmer,126.01,240.4,115.67,192.78,548.85,Single-ply,SBD,M
Boys,124.74+,6,Gabe Acosta,Maud,153.77,215.46,124.74,181.44,521.63,Single-ply,SBD,M
