Name,Sex,WeightClassKg,Division,Best3SquatKg,Best3BenchKg,Best3DeadliftKg,TotalKg,Place,Event,Equipment
Ray Posner,M,90,Masters 2,115,185,150,450,1,SBD,Single-ply
Vincent Loke,M,100,Open,245,147.5,230,622.5,2,SBD,Single-ply
Maged Abdou,M,100,Open,290,190,260,740,1,SBD,Single-ply
John Sukkar,M,125,Open,220,150,265,635,1,SBD,Single-ply
Martin Reynolds,M,90,Masters 1,,127.5,,127.5,1,B,Single-ply
Tony Sommerville,M,90,Masters 3,,140,,140,1,B,Single-ply
Joshua Reynolds,M,100,Open,,95,,95,1,B,Single-ply
Strase Strojanoski,M,110,Open,,170,,170,1,B,Single-ply
