Division,WeightClassKg,Place,Name,Team,BodyweightKg,Best3SquatKg,Best3BenchKg,Best3DeadliftKg,TotalKg,Equipment,Event,Sex
Boys,51.71,1,Nate Lunsford,Frisco Wakeland,51.26,127.01,74.84,124.74,326.59,Single-ply,SBD,M
Boys,51.71,2,Matthew Read,Frisco Heritage,51.26,61.23,47.63,72.57,181.44,Single-ply,SBD,M
Boys,51.71,DQ,Jordan Brooks,Frisco,51.71,83.91,,,,Single-ply,SBD,M
Boys,51.71,DQ,Cameron Police,Frisco Wakeland,50.53,,,,,Single-ply,SBD,M
Boys,55.79,1,Gavin Carroll,Frisco Wakeland,55.61,115.67,70.31,113.4,299.37,Single-ply,SBD,M
Boys,55.79,2,Brady Gordon,Frisco Centennial,54.61,92.99,68.04,102.06,263.08,Single-ply,SBD,M
Boys,55.79,DQ,Carlos Reynoso,McKinney Boyd,55.16,,,,,Single-ply,SBD,M
Boys,59.87,1,Logan Police,Frisco Wakeland,57.06,142.88,90.72,167.83,401.43,Single-ply,SBD,M
Boys,67.13,2,Justin Acosta,Frisco Lone Star,59.96,161.03,95.25,145.15,401.43,Single-ply,SBD,M
Boys,59.87,DQ,Jack Brown,Frisco Heritage,57.97,83.91,,,,Single-ply,SBD,M
Boys,67.13,1,Gerald Van Ess,McKinney North,62.6,195.04,113.4,181.44,489.88,Single-ply,SBD,M
Boys,67.13,2,Andrew Wilson,Frisco Wakeland,63.96,188.24,102.06,188.24,478.54,Single-ply,SBD,M
Boys,67.13,3,Malik Taylor,Frisco Liberty,61.14,149.69,92.99,179.17,421.84,Single-ply,SBD,M
Boys,67.13,4,Bailey Forst,Frisco Heritage,66.22,149.69,83.91,161.03,394.63,Single-ply,SBD,M
Boys,67.13,5,Kolby Dodson,Frisco Centennial,65.5,140.61,104.33,145.15,390.09,Single-ply,SBD,M
Boys,67.13,6,Tanner Laycock,Frisco Centennial,62.78,142.88,90.72,142.88,376.48,Single-ply,SBD,M
Boys,67.13,7,James Williamson,Frisco Wakeland,66.59,129.27,90.72,136.08,356.07,Single-ply,SBD,M
Boys,67.13,8,Uy Troung,Frisco Lone Star,64.77,124.74,74.84,142.88,342.46,Single-ply,SBD,M
Boys,67.13,9,Aj Womack,Frisco Lone Star,67.04,115.67,83.91,133.81,333.39,Single-ply,SBD,M
Boys,67.13,10,Cameron Cotogmo,McKinney Boyd,63.78,83.91,83.91,124.74,292.57,Single-ply,SBD,M
Boys,67.13,DQ,Nico Barlis,Frisco Centennial,65.41,142.88,72.57,,,Single-ply,SBD,M
Boys,74.84,1,George Kennard,Frisco Wakeland,70.22,163.29,117.93,174.63,455.86,Single-ply,SBD,M
Boys,74.84,2,Ricky Fantroy,McKinney,68.58,158.76,86.18,174.63,419.57,Single-ply,SBD,M
Boys,74.84,3,Jake Schumacher,Frisco Centennial,68.22,154.22,108.86,151.95,415.04,Single-ply,SBD,M
Boys,74.84,4,Mike Edwards,Frisco Liberty,73.84,142.88,99.79,145.15,387.82,Single-ply,SBD,M
Boys,74.84,5,Hunter Smith,Frisco Wakeland,73.3,145.15,79.38,145.15,369.68,Single-ply,SBD,M
Boys,74.84,6,Kyle Johnson,Frisco,74.03,120.2,97.52,151.95,369.68,Single-ply,SBD,M
Boys,74.84,7,Sean Moore,McKinney,70.22,136.08,72.57,149.69,358.34,Single-ply,SBD,M
Boys,74.84,8,Jonathan Hobart,McKinney,71.12,120.2,72.57,149.69,342.46,Single-ply,SBD,M
Boys,82.1,9,Ethan Johnson,McKinney Boyd,74.93,111.13,68.04,136.08,315.25,Single-ply,SBD,M
Boys,74.84,DQ,Edouard Lesaux,Frisco Heritage,73.94,129.27,,,,Single-ply,SBD,M
Boys,74.84,DQ,Doren Gibson,McKinney Boyd,73.03,138.35,,158.76,,Single-ply,SBD,M
Boys,82.1,1,Tapiwa Mudehwe,Frisco Centennial,76.38,174.63,117.93,181.44,474,Single-ply,SBD,M
Boys,82.1,2,Tyler Batson,McKinney,81.28,147.42,99.79,167.83,415.04,Single-ply,SBD,M
Boys,82.1,3,Wyatt Park,McKinney Boyd,77.11,145.15,95.25,158.76,399.16,Single-ply,SBD,M
Boys,82.1,4,Griffin Collins,Frisco Liberty,81.74,151.95,92.99,133.81,378.75,Single-ply,SBD,M
Boys,82.1,5,Mathew Rechsteiner,Frisco Heritage,78.2,129.27,92.99,151.95,374.21,Single-ply,SBD,M
Boys,82.1,6,Matt Hinkle,McKinney North,80.29,140.61,79.38,136.08,356.07,Single-ply,SBD,M
Boys,82.1,7,Isaac Williams,Frisco Centennial,76.93,129.27,83.91,136.08,349.27,Single-ply,SBD,M
Boys,82.1,DQ,Matt Melvin,McKinney Boyd,81.83,127.01,,,,Single-ply,SBD,M
Boys,89.81,1,Andrew Reagan,Frisco Liberty,86.09,165.56,106.59,183.7,455.86,Single-ply,SBD,M
Boys,89.81,2,Richard McNamara,Frisco Liberty,87.27,174.63,111.13,151.95,437.72,Single-ply,SBD,M
Boys,89.81,3,Zach Borenberg,McKinney Boyd,89.72,142.88,104.33,183.7,430.91,Single-ply,SBD,M
Boys,89.81,4,Tyler Shumway,Frisco Liberty,84.1,151.95,102.06,147.42,401.43,Single-ply,SBD,M
Boys,89.81,5,Logan Jones,Frisco Lone Star,89.54,147.42,83.91,147.42,378.75,Single-ply,SBD,M
Boys,89.81,6,Braden Labrie-Torres,Frisco Heritage,89.81,136.08,88.45,147.42,371.95,Single-ply,SBD,M
Boys,89.81,DQ,Khalil Lewis,McKinney North,89.81,136.08,,,,Single-ply,SBD,M
Boys,99.79,1,Alec Melkovitz,Frisco Centennial,91.44,190.51,127.01,185.97,503.49,Single-ply,SBD,M
Boys,99.79,2,Jared Morris,McKinney North,95.16,158.76,108.86,226.8,494.42,Single-ply,SBD,M
Boys,99.79,3,Dorrian Ogas,Frisco Liberty,98.97,174.63,129.27,183.7,487.61,Single-ply,SBD,M
Boys,99.79,4,Ryan Knesek,Frisco Wakeland,95.8,183.7,92.99,204.12,480.81,Single-ply,SBD,M
Boys,99.79,5,Jake Day,Frisco Lone Star,99.61,163.29,102.06,183.7,449.06,Single-ply,SBD,M
Boys,99.79,6,Noah Forte,McKinney North,99.79,158.76,97.52,183.7,439.98,Single-ply,SBD,M
Boys,99.79,7,Walker Torrain,McKinney,92.9,170.1,90.72,158.76,419.57,Single-ply,SBD,M
Boys,99.79,8,Nick Barona,Frisco Centennial,99.79,145.15,108.86,142.88,396.89,Single-ply,SBD,M
Boys,99.79,9,Gage Lowe,Frisco Centennial,91.81,147.42,95.25,142.88,385.55,Single-ply,SBD,M
Boys,99.79,10,Zach Rupe,McKinney,99.06,124.74,108.86,149.69,383.29,Single-ply,SBD,M
Boys,99.79,11,Michael Carpin,Frisco Heritage,95.07,142.88,111.13,120.2,374.21,Single-ply,SBD,M
Boys,99.79,12,Vincent Ton,Frisco,97.98,133.81,88.45,149.69,371.95,Single-ply,SBD,M
Boys,99.79,13,Maurico Romero,Frisco Heritage,95.62,113.4,99.79,151.95,365.14,Single-ply,SBD,M
Boys,99.79,14,Elijah Klopatex,Frisco,98.79,102.06,77.11,120.2,299.37,Single-ply,SBD,M
Boys,99.79,DQ,Sergio Aldana,Frisco,93.44,,,,,Single-ply,SBD,M
Boys,99.79,DQ,Blake Bass,McKinney Boyd,96.89,,,,,Single-ply,SBD,M
Boys,109.77,1,Gage Rieter,Frisco Liberty,102.6,183.7,142.88,197.31,523.9,Single-ply,SBD,M
Boys,109.77,2,Drew Grisham,McKinney North,103.42,185.97,113.4,210.92,510.29,Single-ply,SBD,M
Boys,109.77,3,Tyler Ballard,Frisco Liberty,106.68,183.7,113.4,163.29,460.4,Single-ply,SBD,M
Boys,109.77,4,Jake Waszkowski,McKinney Boyd,105.32,127.01,115.67,179.17,421.84,Single-ply,SBD,M
Boys,124.74,5,Kevin Mair,Frisco Heritage,109.86,142.88,86.18,147.42,376.48,Single-ply,SBD,M
Boys,109.77,6,Will Wagner,Frisco,106.05,127.01,97.52,142.88,367.41,Single-ply,SBD,M
Boys,109.77,DQ,Andres Salerno,Frisco,109.23,,,,,Single-ply,SBD,M
Boys,109.77,DQ,Jett Carson,McKinney,103.6,124.74,,,,Single-ply,SBD,M
Boys,124.74,1,Camren Thompson,Frisco Wakeland,123.65,238.14,131.54,226.8,596.47,Single-ply,SBD,M
Boys,124.74,2,Phillip Abramo,Frisco,119.93,204.12,127.01,185.97,517.1,Single-ply,SBD,M
Boys,124.74,3,Blaine Nuckols,Frisco Heritage,120.02,204.12,115.67,192.78,512.56,Single-ply,SBD,M
Boys,124.74,4,Donovan Taylor,Frisco Centennial,119.11,192.78,127.01,188.24,508.02,Single-ply,SBD,M
Boys,124.74,5,Caleb Stricklin,McKinney,116.75,199.58,122.47,183.7,505.76,Single-ply,SBD,M
Boys,124.74,6,Constantino Zuniga,McKinney North,117.48,181.44,95.25,208.65,485.34,Single-ply,SBD,M
Boys,124.74,7,Christian Hernandez,Frisco Lone Star,114.21,181.44,122.47,165.56,469.47,Single-ply,SBD,M
Boys,124.74,8,Connor Wilkinson,Frisco,113.58,142.88,102.06,215.46,460.4,Single-ply,SBD,M
Boys,124.74,9,Bailey Becker,Frisco Heritage,121.74,158.76,117.93,172.37,449.06,Single-ply,SBD,M
Boys,124.74,10,Dawson Deaton,Frisco,119.11,115.67,104.33,136.08,356.07,Single-ply,SBD,M
Boys,124.74+,1,Alec Jamar,Frisco Liberty,130.82,231.33,145.15,190.51,566.99,Single-ply,SBD,M
Boys,124.74+,2,Alex Boyer,Frisco Liberty,126.82,213.19,142.88,195.04,551.11,Single-ply,SBD,M
Boys,124.74+,3,Patrick Quintana,McKinney Boyd,139.34,217.72,138.35,188.24,544.31,Single-ply,SBD,M
Boys,124.74+,4,Zach Thomas,McKinney North,144.06,181.44,129.27,190.51,501.22,Single-ply,SBD,M
Boys,124.74+,5,Tanner Lesser,Frisco Lone Star,126.19,161.03,111.13,183.7,455.86,Single-ply,SBD,M
Boys,124.74+,DQ,Jaxson Deaton,Frisco,143.7,183.7,,,,Single-ply,SBD,M
