Division,WeightClassKg,Place,Name,Team,BodyweightKg,Best3SquatKg,Best3BenchKg,Best3DeadliftKg,TotalKg,Equipment,Event,Sex
Boys,51.71,1,Joseph Woodyard,Abilene,51.62,83.91,58.97,111.13,254.01,Single-ply,SBD,M
Boys,51.71,2,Jj Galvan,Abilene,51.17,83.91,56.7,106.59,247.21,Single-ply,SBD,M
Boys,51.71,3,Zach Kerley,Abilene Cooper,46.45,83.91,56.7,88.45,229.06,Single-ply,SBD,M
Boys,51.71,4,Roberto Hernandez,Abilene Cooper,49.85,70.31,58.97,61.23,190.51,Single-ply,SBD,M
Boys,55.79,1,Chris Jackson,Sweetwater,54.79,154.22,113.4,158.76,426.38,Single-ply,SBD,M
Boys,55.79,2,Jacob Renfro,Abilene,55.79,104.33,72.57,124.74,301.64,Single-ply,SBD,M
Boys,55.79,3,Emilio Fernandez,Abilene Cooper,54.98,92.99,74.84,113.4,281.23,Single-ply,SBD,M
Boys,55.79,4,Christian Martin,Abilene Cooper,55.43,106.59,52.16,111.13,269.89,Single-ply,SBD,M
Boys,55.79,5,Don Bridges,Tuscola Jim Ned,54.7,90.72,54.43,111.13,256.28,Single-ply,SBD,M
Boys,59.87,1,Jesus Menjivar,Abilene Cooper,59.69,161.03,92.99,176.9,430.91,Single-ply,SBD,M
Boys,59.87,2,Miguel Arroyo,San Angelo Lake View,59.87,154.22,86.18,167.83,408.23,Single-ply,SBD,M
Boys,59.87,3,Riley Perry,Tuscola Jim Ned,58.24,133.81,92.99,149.69,376.48,Single-ply,SBD,M
Boys,59.87,4,Lleyton Frazier,Tuscola Jim Ned,57.33,127.01,81.65,149.69,358.34,Single-ply,SBD,M
Boys,59.87,5,Austin Tobar,Abilene Cooper,59.78,127.01,79.38,108.86,315.25,Single-ply,SBD,M
Boys,59.87,6,Blake Scott,Sweetwater,59.15,124.74,77.11,106.59,308.44,Single-ply,SBD,M
Boys,59.87,7,Nathan Embila,Abilene,58.51,115.67,70.31,117.93,303.91,Single-ply,SBD,M
Boys,59.87,8,Brody Stanford,Abilene Cooper,59.78,113.4,61.23,127.01,301.64,Single-ply,SBD,M
Boys,67.13,1,Cade Cramer,Mertzon Irion County,65.23,172.37,102.06,154.22,428.64,Single-ply,SBD,M
Boys,67.13,2,Jeremy Mireles,San Angelo Lake View,66.59,149.69,97.52,167.83,415.04,Single-ply,SBD,M
Boys,67.13,3,Joe Flores,Abilene Cooper,66.86,147.42,83.91,179.17,410.5,Single-ply,SBD,M
Boys,67.13,4,Anthony Martinez,San Angelo Lake View,67.04,129.27,95.25,138.35,362.87,Single-ply,SBD,M
Boys,67.13,5,Carson Parker,Merkel,63.5,129.27,79.38,151.95,360.61,Single-ply,SBD,M
Boys,67.13,6,Adam Hathaway,Merkel,60.87,117.93,65.77,147.42,331.12,Single-ply,SBD,M
Boys,67.13,7,Travis Rowaldt,San Angelo Lake View,66.32,106.59,81.65,140.61,328.85,Single-ply,SBD,M
Boys,67.13,8,Joe Angel Torres,Abilene,64.95,124.74,74.84,124.74,324.32,Single-ply,SBD,M
Boys,67.13,9,Kirkland Leverett,Abilene,62.05,124.74,61.23,136.08,322.05,Single-ply,SBD,M
Boys,67.13,10,Gunnar McCoy,Water Valley,65.68,115.67,70.31,136.08,322.05,Single-ply,SBD,M
Boys,67.13,11,Nick Massey,Merkel,64.77,111.13,70.31,136.08,317.51,Single-ply,SBD,M
Boys,67.13,12,Ben Sanchez,San Angelo Central,61.87,120.2,65.77,108.86,294.84,Single-ply,SBD,M
Boys,67.13,13,Mark Leyva,Merkel,63.05,113.4,61.23,120.2,294.84,Single-ply,SBD,M
Boys,67.13,14,Michael Torres,Merkel,60.69,106.59,54.43,124.74,285.76,Single-ply,SBD,M
Boys,67.13,DQ,Josh Camacho,Sweetwater,65.95,142.88,,,,Single-ply,SBD,M
Boys,67.13,DQ,Kendall Adames,Sweetwater,62.69,142.88,83.91,,,Single-ply,SBD,M
Boys,74.84,1,Braden Jowers,San Angelo Lake View,70.67,149.69,97.52,167.83,415.04,Single-ply,SBD,M
Boys,74.84,2,Jorge Hernandez,Abilene,74.75,154.22,90.72,170.1,415.04,Single-ply,SBD,M
Boys,74.84,3,Aiden Fuentes,San Angelo Central,72.3,142.88,86.18,179.17,408.23,Single-ply,SBD,M
Boys,74.84,4,Slade Shipman,Merkel,70.03,124.74,83.91,156.49,365.14,Single-ply,SBD,M
Boys,74.84,5,Phonzo Dotson,Abilene,73.94,147.42,72.57,127.01,347,Single-ply,SBD,M
Boys,74.84,6,Henry Ferrel,Abilene Cooper,74.3,131.54,74.84,136.08,342.46,Single-ply,SBD,M
Boys,74.84,DQ,Gabriel Camargo,Anson,74.84,,,,,Single-ply,SBD,M
Boys,74.84,DQ,Jackson Timme,San Angelo Central,72.67,174.63,,,,Single-ply,SBD,M
Boys,74.84,DQ,Bobby Pena,San Angelo Central,68.95,147.42,,,,Single-ply,SBD,M
Boys,82.1,1,Bubba Christensen,San Angelo Lake View,77.66,197.31,120.2,192.78,510.29,Single-ply,SBD,M
Boys,82.1,2,Emile Niyonkuru,Abilene Cooper,78.02,190.51,102.06,197.31,489.88,Single-ply,SBD,M
Boys,82.1,3,Michael Bartlett,Abilene,76.84,172.37,90.72,185.97,449.06,Single-ply,SBD,M
Boys,82.1,4,Elijah Moser,Anson,79.74,165.56,90.72,188.24,444.52,Single-ply,SBD,M
Boys,82.1,5,Xavier Carrillo,Abilene,80.74,158.76,88.45,181.44,428.64,Single-ply,SBD,M
Boys,82.1,6,Carter Christensen,San Angelo Lake View,79.92,149.69,104.33,165.56,419.57,Single-ply,SBD,M
Boys,82.1,7,Phillip Tellez,Abilene,79.88,154.22,95.25,154.22,403.7,Single-ply,SBD,M
Boys,82.1,8,Warren Pike,Merkel,75.66,145.15,70.31,181.44,396.89,Single-ply,SBD,M
Boys,82.1,9,Andres Neri,Sweetwater,80.47,127.01,88.45,129.27,344.73,Single-ply,SBD,M
Boys,82.1,10,Robin Tacker,Anson,76.57,113.4,72.57,120.2,306.17,Single-ply,SBD,M
Boys,82.1,11,Dallas Camargo,Anson,77.29,92.99,58.97,106.59,258.55,Single-ply,SBD,M
Boys,82.1,DQ,Jesse Edgar,Mertzon Irion County,80.38,142.88,,,,Single-ply,SBD,M
Boys,89.81,1,Caleb Wilson,Mertzon Irion County,85.18,272.16,149.69,249.48,671.32,Single-ply,SBD,M
Boys,89.81,2,Devin Romero,Abilene,88.09,235.87,117.93,233.6,587.4,Single-ply,SBD,M
Boys,89.81,3,Tommy Allmand,Abilene Cooper,86.82,204.12,120.2,174.63,498.95,Single-ply,SBD,M
Boys,89.81,4,Logan King,Sweetwater,89.45,136.08,115.67,151.95,403.7,Single-ply,SBD,M
Boys,89.81,5,Max Bradley,Water Valley,87.72,138.35,79.38,156.49,374.21,Single-ply,SBD,M
Boys,89.81,6,Kyle St John,Anson,87.45,129.27,74.84,140.61,344.73,Single-ply,SBD,M
Boys,89.81,DQ,Noah Talamaniez,San Angelo Central,85.82,97.52,,,,Single-ply,SBD,M
Boys,99.79,1,Harley Ford,Abilene,95.16,204.12,104.33,192.78,501.22,Single-ply,SBD,M
Boys,99.79,2,Blake Miller,Mertzon Irion County,93.98,181.44,136.08,181.44,498.95,Single-ply,SBD,M
Boys,99.79,3,Jacob Turner,Tuscola Jim Ned,91.35,181.44,106.59,204.12,492.15,Single-ply,SBD,M
Boys,99.79,4,Griffin Cooke,Abilene,91.72,197.31,104.33,179.17,480.81,Single-ply,SBD,M
Boys,99.79,5,Donatello Tovar,San Angelo Lake View,92.08,181.44,120.2,179.17,480.81,Single-ply,SBD,M
Boys,99.79,6,Xavier Graves,Abilene,97.43,190.51,104.33,179.17,474,Single-ply,SBD,M
Boys,99.79,7,Toby Lambert,San Angelo Lake View,94.71,176.9,127.01,167.83,471.74,Single-ply,SBD,M
Boys,99.79,8,Xavier Jenkins,Abilene Cooper,92.22,165.56,102.06,185.97,453.59,Single-ply,SBD,M
Boys,99.79,9,Jayden Harms,Abilene Cooper,94.44,176.9,90.72,174.63,442.25,Single-ply,SBD,M
Boys,99.79,10,Kade Miller,Tuscola Jim Ned,98.97,145.15,83.91,172.37,401.43,Single-ply,SBD,M
Boys,99.79,11,Skyler Pulattie,Sweetwater,97.16,138.35,70.31,111.13,319.78,Single-ply,SBD,M
Boys,99.79,DQ,Arthur Murillo,Tuscola Jim Ned,91.81,,,,,Single-ply,SBD,M
Boys,99.79,DQ,John Wheeler,Tuscola Jim Ned,94.35,183.7,117.93,,,Single-ply,SBD,M
Boys,109.77,1,Brandon Padilla,Anson,109.32,272.16,142.88,242.67,657.71,Single-ply,SBD,M
Boys,109.77,2,Zack Thompson,Abilene,106.96,231.33,154.22,213.19,598.74,Single-ply,SBD,M
Boys,109.77,3,Colton Grimes,Abilene Cooper,108.45,199.58,127.01,188.24,514.83,Single-ply,SBD,M
Boys,109.77,4,Justin Castereno,Sweetwater,105.05,206.38,108.86,197.31,512.56,Single-ply,SBD,M
Boys,109.77,5,Jaxon Smith,Abilene,107.23,201.85,117.93,183.7,503.49,Single-ply,SBD,M
Boys,109.77,6,Kade Heatherly,Abilene Cooper,105.41,188.24,92.99,190.51,471.74,Single-ply,SBD,M
Boys,109.77,7,Triston Patterson,Tuscola Jim Ned,101.24,170.1,102.06,188.24,460.4,Single-ply,SBD,M
Boys,109.77,8,Lucas Gomez,Abilene,107.5,188.24,102.06,158.76,449.06,Single-ply,SBD,M
Boys,109.77,9,Xavier Cortez,Abilene,107.82,188.24,90.72,163.29,442.25,Single-ply,SBD,M
Boys,109.77,10,Gavin Reyes,Sweetwater,108.86,156.49,106.59,170.1,433.18,Single-ply,SBD,M
Boys,109.77,11,Joshua Diaz,San Angelo Central,103.6,147.42,92.99,154.22,394.63,Single-ply,SBD,M
Boys,124.74,1,Israel DelaCruz,Anson,113.85,233.6,124.74,192.78,551.11,Single-ply,SBD,M
Boys,124.74,2,Eddie Hernandez,Anson,116.39,215.46,102.06,197.31,514.83,Single-ply,SBD,M
Boys,124.74,3,David Galvan,Anson,119.93,192.78,115.67,204.12,512.56,Single-ply,SBD,M
Boys,124.74,4,Justin Smith,Abilene Cooper,116.66,195.04,97.52,192.78,485.34,Single-ply,SBD,M
Boys,124.74,5,CJ Ugalde,Merkel,119.02,201.85,115.67,158.76,476.27,Single-ply,SBD,M
Boys,124.74,6,Michaelin Toney,Abilene Cooper,110.95,179.17,115.67,179.17,474,Single-ply,SBD,M
Boys,124.74,7,Cole Pendleton,Tuscola Jim Ned,121.11,161.03,102.06,154.22,417.3,Single-ply,SBD,M
Boys,124.74,8,Matthew Roberts,Abilene,121.56,158.76,90.72,147.42,396.89,Single-ply,SBD,M
Boys,124.74,DQ,Gavin Fields,San Angelo Central,113.76,192.78,,,,Single-ply,SBD,M
Boys,124.74+,1,Taylor Elkins,Mertzon Irion County,143.34,274.42,170.1,238.14,682.66,Single-ply,SBD,M
Boys,124.74+,2,Max Rodriguez,Sweetwater,126.46,226.8,127.01,215.46,569.26,Single-ply,SBD,M
Boys,124.74+,3,Jeremiah Barrera,Sweetwater,130.63,226.8,102.06,224.53,553.38,Single-ply,SBD,M
Boys,124.74+,4,Devon Cosby,Abilene Cooper,126.1,208.65,127.01,208.65,544.31,Single-ply,SBD,M
Boys,124.74+,5,David Schuman,Merkel,126.64,219.99,136.08,188.24,544.31,Single-ply,SBD,M
Boys,124.74+,6,Thomas Squyres,Abilene Cooper,127.19,204.12,142.88,188.24,535.24,Single-ply,SBD,M
Boys,124.74+,7,Ricardo Rios,Abilene Cooper,137.35,215.46,117.93,195.04,528.44,Single-ply,SBD,M
Boys,124.74+,8,Gage McVey,Abilene Cooper,129.64,204.12,129.27,183.7,517.1,Single-ply,SBD,M
Boys,124.74+,9,Jaron Castillo,Anson,129.73,219.99,108.86,183.7,512.56,Single-ply,SBD,M
Boys,124.74+,10,Xosue Duran,San Angelo Lake View,160.57,183.7,108.86,204.12,496.68,Single-ply,SBD,M
Boys,124.74+,11,Khalil Spivey,Abilene,126.51,188.24,92.99,172.37,453.59,Single-ply,SBD,M
Boys,124.74+,12,Javier Santana,Abilene,131,192.78,92.99,154.22,439.98,Single-ply,SBD,M
Boys,124.74+,13,Jonathan Presley,Abilene Cooper,150.37,158.76,83.91,149.69,392.36,Single-ply,SBD,M
Boys,,NS,Diego Mata,Abilene Cooper,,,,,,Single-ply,SBD,M
Boys,,NS,Dieder Kanyabitabo,Abilene Cooper,,,,,,Single-ply,SBD,M
Boys,,NS,Caleb Chacon,Merkel,,,,,,Single-ply,SBD,M
Boys,,NS,Kanen Herd,Merkel,,,,,,Single-ply,SBD,M
Boys,,NS,Clayton Sparks,Merkel,,,,,,Single-ply,SBD,M
Boys,,NS,Nicholas Billington,Mertzon Irion County,,,,,,Single-ply,SBD,M
Boys,,NS,Allen Bradey,San Angelo Central,,,,,,Single-ply,SBD,M
Boys,,NS,Rowdy Garza,San Angelo Central,,,,,,Single-ply,SBD,M
Boys,,NS,Cody Coombs,San Angelo Lake View,,,,,,Single-ply,SBD,M
Boys,,NS,Rob Young,Tuscola Jim Ned,,,,,,Single-ply,SBD,M
Boys,,NS,Tye Landeros,Tuscola Jim Ned,,,,,,Single-ply,SBD,M
