Division,WeightClassKg,Place,Name,Team,BodyweightKg,Best3SquatKg,Best3BenchKg,Best3DeadliftKg,TotalKg,Equipment,Event,Sex
Boys,51.71,1,Haif Martinez,Lewisville The Colony,51.71,174.63,95.25,183.7,453.59,Single-ply,SBD,M
Boys,51.71,2,Victor Peluso,Frisco Wakeland,51.71,131.54,95.25,136.08,362.87,Single-ply,SBD,M
Boys,51.71,3,Cassius Fitzpatrick,Denison,51.35,124.74,79.38,124.74,328.85,Single-ply,SBD,M
Boys,55.79,4,Axel Banks,Denison,51.8,102.06,74.84,120.2,297.1,Single-ply,SBD,M
Boys,51.71,5,Michael Robason,Frisco Wakeland,51.53,129.27,61.23,99.79,290.3,Single-ply,SBD,M
Boys,51.71,6,Jacob Lopez,Ferris,50.98,86.18,43.09,92.99,222.26,Single-ply,SBD,M
Boys,55.79,1,Carlos Bravo,Lewisville The Colony,55.79,188.24,102.06,192.78,483.08,Single-ply,SBD,M
Boys,55.79,2,Demitri Sommer,Lewisville The Colony,55.79,188.24,79.38,192.78,460.4,Single-ply,SBD,M
Boys,55.79,3,Joey Silva,Garland Sachse,55.07,167.83,83.91,158.76,410.5,Single-ply,SBD,M
Boys,55.79,4,Steven Lira,Little Elm,54.43,149.69,88.45,149.69,387.82,Single-ply,SBD,M
Boys,55.79,5,Matt Castillo,North Mesquite,55.79,136.08,70.31,149.69,356.07,Single-ply,SBD,M
Boys,55.79,6,Jared Hamilton,Cedar Hill,53.52,129.27,65.77,136.08,331.12,Single-ply,SBD,M
Boys,55.79,7,Jahaziel Patterson,Carrollton Turner,53.34,108.86,74.84,124.74,308.44,Single-ply,SBD,M
Boys,59.87,8,Jacob Wantroba,Denison,55.97,117.93,68.04,92.99,278.96,Single-ply,SBD,M
Boys,55.79,9,Rowan Wroten,Frisco Heritage,55.79,88.45,65.77,90.72,244.94,Single-ply,SBD,M
Boys,55.79,10,Blake Weaver,Frisco Heritage,53.98,70.31,52.16,92.99,215.46,Single-ply,SBD,M
Boys,55.79,DQ,Trey Patton,Frisco Wakeland,53.8,136.08,,,,Single-ply,SBD,M
Boys,59.87,1,Richard Hernandez,Lewisville The Colony,59.87,219.99,129.27,204.12,553.38,Single-ply,SBD,M
Boys,59.87,2,Zack Rose,Cedar Hill,59.51,138.35,74.84,158.76,371.95,Single-ply,SBD,M
Boys,59.87,3,Cesar Franco,Ferris,58.15,145.15,70.31,149.69,365.14,Single-ply,SBD,M
Boys,59.87,4,Re Knight,Frisco Centennial,59.87,133.81,83.91,131.54,349.27,Single-ply,SBD,M
Boys,59.87,5,Travis Turpin,McKinney Boyd,59.87,113.4,70.31,140.61,324.32,Single-ply,SBD,M
Boys,59.87,6,Seth Griffith,McKinney Boyd,57.88,113.4,65.77,124.74,303.91,Single-ply,SBD,M
Boys,59.87,7,Said Caro,Cedar Hill,57.42,102.06,65.77,102.06,269.89,Single-ply,SBD,M
Boys,59.87,DQ,Brandon Lewellan,Frisco Wakeland,59.51,,,,,Single-ply,SBD,M
Boys,67.13,DQ,Jeff Iawinin,Bishop Lynch,59.96,,,,,Single-ply,SBD,M
Boys,67.13,1,Aj Hunter,Garland Sachse,66.86,174.63,115.67,195.04,485.34,Single-ply,SBD,M
Boys,67.13,2,Tim Sanders,Lewisville The Colony,67.04,181.44,104.33,190.51,476.27,Single-ply,SBD,M
Boys,67.13,3,Dontae Luke,North Mesquite,67.13,181.44,120.2,167.83,469.47,Single-ply,SBD,M
Boys,67.13,4,Bradley Beck,McKinney,62.87,170.1,104.33,181.44,455.86,Single-ply,SBD,M
Boys,67.13,5,Nate Jones,Lewisville The Colony,66.86,179.17,102.06,170.1,451.32,Single-ply,SBD,M
Boys,67.13,6,Errol Cox,Lewisville The Colony,65.77,181.44,74.84,192.78,449.06,Single-ply,SBD,M
Boys,67.13,7,Devaughn Childress,Frisco Wakeland,66.04,167.83,97.52,170.1,435.45,Single-ply,SBD,M
Boys,74.84,8,Mason Pierce,Frisco Centennial,67.31,147.42,102.06,163.29,412.77,Single-ply,SBD,M
Boys,67.13,9,Zack Stevens,McKinney Boyd,65.14,147.42,83.91,170.1,401.43,Single-ply,SBD,M
Boys,67.13,10,Nick Baril,Frisco Centennial,62.51,147.42,102.06,138.35,387.82,Single-ply,SBD,M
Boys,74.84,11,Roddal Smith,Cedar Hill,67.36,136.08,102.06,131.54,369.68,Single-ply,SBD,M
Boys,67.13,12,Marc Bresnahan,McKinney North,63.96,136.08,79.38,149.69,365.14,Single-ply,SBD,M
Boys,67.13,13,David Block,Denison,65.23,129.27,74.84,142.88,347,Single-ply,SBD,M
Boys,67.13,14,Phelps Phelps,McKinney,66.77,131.54,77.11,136.08,344.73,Single-ply,SBD,M
Boys,67.13,15,Syldarien Brown,Cedar Hill,63.05,113.4,68.04,149.69,331.12,Single-ply,SBD,M
Boys,67.13,16,Jared Silva,Bishop Lynch,66.04,124.74,65.77,124.74,315.25,Single-ply,SBD,M
Boys,67.13,17,Dalton Ortiz,McKinney Boyd,66.41,108.86,70.31,127.01,306.17,Single-ply,SBD,M
Boys,67.13,18,Billy Mixon,Bishop Lynch,66.32,108.86,70.31,120.2,299.37,Single-ply,SBD,M
Boys,67.13,DQ,Alex Krakosy,Bishop Lynch,66.86,136.08,,,,Single-ply,SBD,M
Boys,67.13,DQ,Aaron Parsonage,McKinney North,66.68,127.01,,,,Single-ply,SBD,M
Boys,67.13,DQ,Austin Parsonage,McKinney North,66.13,136.08,,,,Single-ply,SBD,M
Boys,67.13,DQ,Dakota Thomas,Denison,66.77,165.56,,,,Single-ply,SBD,M
Boys,74.84,DQ,Cameron Peters,Frisco Centennial,67.31,,,,,Single-ply,SBD,M
Boys,74.84,1,Ryan Abraham,Frisco Centennial,74.66,174.63,140.61,219.99,535.24,Single-ply,SBD,M
Boys,74.84,2,Horace Borders,North Mesquite,74.12,204.12,117.93,208.65,530.7,Single-ply,SBD,M
Boys,74.84,3,JR Pena,Ferris,73.48,183.7,95.25,192.78,471.74,Single-ply,SBD,M
Boys,74.84,4,Ben Adams,Cedar Hill,72.57,170.1,97.52,195.04,462.66,Single-ply,SBD,M
Boys,74.84,5,Collin Olson,Lewisville The Colony,73.62,174.63,86.18,192.78,453.59,Single-ply,SBD,M
Boys,82.1,6,Aj Stephens,Cedar Hill,74.93,170.1,92.99,185.97,449.06,Single-ply,SBD,M
Boys,74.84,7,Seth Pratt,McKinney Boyd,72.76,158.76,106.59,181.44,446.79,Single-ply,SBD,M
Boys,74.84,8,Nigel Barlis,Frisco Centennial,69.67,158.76,111.13,163.29,433.18,Single-ply,SBD,M
Boys,74.84,9,Frank Perdomo,Lewisville The Colony,74.84,142.88,95.25,181.44,419.57,Single-ply,SBD,M
Boys,74.84,10,Andres Sandoval,Ferris,67.95,149.69,122.47,142.88,415.04,Single-ply,SBD,M
Boys,74.84,11,Nick Segovia,Frisco Centennial,73.39,158.76,113.4,142.88,415.04,Single-ply,SBD,M
Boys,74.84,12,James Ray #2,McKinney North,69.04,154.22,88.45,161.03,403.7,Single-ply,SBD,M
Boys,82.1,13,Lamar Jordan,Frisco Centennial,75.02,149.69,95.25,158.76,403.7,Single-ply,SBD,M
Boys,74.84,14,Tre Smith,McKinney North,70.22,136.08,92.99,172.37,401.43,Single-ply,SBD,M
Boys,74.84,15,Logan Miller,Frisco Centennial,74.03,158.76,83.91,151.95,394.63,Single-ply,SBD,M
Boys,74.84,16,Alex Kinsella,Frisco Centennial,69.04,149.69,95.25,145.15,390.09,Single-ply,SBD,M
Boys,74.84,17,Neal Botteron,Frisco Heritage,71.94,108.86,104.33,136.08,349.27,Single-ply,SBD,M
Boys,74.84,18,D. Frazier,Cedar Hill,74.12,124.74,77.11,142.88,344.73,Single-ply,SBD,M
Boys,74.84,19,Deandre Bedford,Cedar Hill,72.21,102.06,79.38,129.27,310.71,Single-ply,SBD,M
Boys,74.84,20,David Lloyd,Cedar Hill,69.4,102.06,65.77,136.08,303.91,Single-ply,SBD,M
Boys,74.84,DQ,Logan Swann,Frisco Wakeland,73.12,,,,,Single-ply,SBD,M
Boys,74.84,DQ,Kyantie Sheffield,Garland Sachse,68.13,,,,,Single-ply,SBD,M
Boys,82.1,1,Zach Long,Little Elm,79.83,233.6,142.88,222.26,598.74,Single-ply,SBD,M
Boys,82.1,2,Austin Arnold,Denison,81.47,210.92,149.69,204.12,564.72,Single-ply,SBD,M
Boys,82.1,3,Lakeylon Rice,Frisco Centennial,79.38,210.92,129.27,201.85,542.04,Single-ply,SBD,M
Boys,82.1,4,Garrett Kraus,Garland Sachse,80.47,213.19,129.27,190.51,532.97,Single-ply,SBD,M
Boys,82.1,5,Keegan McCarthy,Garland Sachse,80.65,197.31,117.93,208.65,523.9,Single-ply,SBD,M
Boys,82.1,6,Collin Charles,Frisco Heritage,79.11,190.51,129.27,197.31,517.1,Single-ply,SBD,M
Boys,82.1,7,Isiah Lewis,Cedar Hill,81.28,192.78,104.33,192.78,489.88,Single-ply,SBD,M
Boys,82.1,8,Shahrukh Khan,Little Elm,77.84,181.44,120.2,181.44,483.08,Single-ply,SBD,M
Boys,82.1,9,Justin Owens,North Mesquite,80.01,167.83,117.93,195.04,480.81,Single-ply,SBD,M
Boys,82.1,10,Brandon Millikin,Garland Sachse,79.11,183.7,111.13,181.44,476.27,Single-ply,SBD,M
Boys,82.1,11,Brandon Wade,Little Elm,77.38,181.44,111.13,181.44,474,Single-ply,SBD,M
Boys,82.1,12,Jon Le,Frisco Centennial,81.56,190.51,106.59,176.9,474,Single-ply,SBD,M
Boys,82.1,13,Ross Abraham,Frisco Centennial,77.56,181.44,97.52,183.7,462.66,Single-ply,SBD,M
Boys,82.1,14,Ed Garcia,McKinney North,81.19,181.44,106.59,170.1,458.13,Single-ply,SBD,M
Boys,82.1,15,Tobechi Oleru,McKinney Boyd,77.75,172.37,92.99,188.24,453.59,Single-ply,SBD,M
Boys,82.1,16,Andrew Roessler,Frisco Wakeland,77.66,170.1,111.13,154.22,435.45,Single-ply,SBD,M
Boys,82.1,17,Reggie Coefield,McKinney North,81.83,151.95,83.91,188.24,424.11,Single-ply,SBD,M
Boys,82.1,18,Matthew Tefferra,Cedar Hill,76.75,149.69,102.06,167.83,419.57,Single-ply,SBD,M
Boys,82.1,19,Marcus Gentry,Ferris,78.56,156.49,104.33,154.22,415.04,Single-ply,SBD,M
Boys,82.1,20,Ivan Sauerzopf,Frisco Lone Star,80.38,136.08,124.74,147.42,408.23,Single-ply,SBD,M
Boys,82.1,21,Jack Flowers,Frisco Wakeland,79.83,172.37,83.91,149.69,405.97,Single-ply,SBD,M
Boys,82.1,22,Anthony Cortez,North Mesquite,76.2,142.88,79.38,163.29,385.55,Single-ply,SBD,M
Boys,82.1,23,Dalton Harris,McKinney,78.74,147.42,79.38,142.88,369.68,Single-ply,SBD,M
Boys,82.1,24,Ben Bouchez,McKinney Boyd,78.83,142.88,74.84,145.15,362.87,Single-ply,SBD,M
Boys,82.1,25,Robert Merryfield,Frisco Heritage,77.47,140.61,77.11,142.88,360.61,Single-ply,SBD,M
Boys,82.1,26,Sean Jones,Frisco Heritage,79.83,124.74,92.99,136.08,353.8,Single-ply,SBD,M
Boys,82.1,27,John Molina,Bishop Lynch,81.47,124.74,74.84,124.74,324.32,Single-ply,SBD,M
Boys,82.1,28,Waites Deborick,Cedar Hill,78.74,127.01,68.04,124.74,319.78,Single-ply,SBD,M
Boys,82.1,DQ,Jackson Clifford,Frisco Centennial,80.1,142.88,,,,Single-ply,SBD,M
Boys,82.1,DQ,Travis Jones,North Mesquite,78.38,,,,,Single-ply,SBD,M
Boys,82.1,DQ,Kenyea Alexander,McKinney North,81.01,188.24,124.74,,,Single-ply,SBD,M
Boys,89.81,1,Aaron Bailey,Frisco Wakeland,88.45,249.48,131.54,226.8,607.81,Single-ply,SBD,M
Boys,99.79,2,Ishmiah Miles,Garland Sachse,89.9,224.53,124.74,233.6,582.87,Single-ply,SBD,M
Boys,89.81,3,Michael Denton,Lewisville The Colony,89.81,235.87,102.06,219.99,557.92,Single-ply,SBD,M
Boys,89.81,4,Logan Matamoros,Frisco Centennial,88.63,185.97,124.74,199.58,510.29,Single-ply,SBD,M
Boys,89.81,5,Corbin Diaz,Frisco Lone Star,87.23,190.51,142.88,165.56,498.95,Single-ply,SBD,M
Boys,89.81,6,Cole Cantrell,Frisco Centennial,87.72,172.37,129.27,192.78,494.42,Single-ply,SBD,M
Boys,89.81,7,Chris Hendricks,Frisco Wakeland,85.55,185.97,99.79,192.78,478.54,Single-ply,SBD,M
Boys,89.81,8,Paine Matiscik,McKinney Boyd,83.64,190.51,99.79,163.29,453.59,Single-ply,SBD,M
Boys,89.81,9,Logan Teel,McKinney North,87.18,181.44,88.45,181.44,451.32,Single-ply,SBD,M
Boys,89.81,10,Ryan Boyd,North Mesquite,87.45,183.7,102.06,161.03,446.79,Single-ply,SBD,M
Boys,89.81,11,Artie Haynes,Bishop Lynch,88,149.69,97.52,190.51,437.72,Single-ply,SBD,M
Boys,89.81,12,Agustine Zavala,McKinney,89.09,158.76,83.91,167.83,410.5,Single-ply,SBD,M
Boys,89.81,13,Chaz Miller,Bishop Lynch,89.81,145.15,86.18,149.69,381.02,Single-ply,SBD,M
Boys,89.81,14,Eric Ramon,Bishop Lynch,89.18,149.69,63.5,122.47,335.66,Single-ply,SBD,M
Boys,89.81,DQ,Brad McAlister,Little Elm,82.46,170.1,124.74,,,Single-ply,SBD,M
Boys,89.81,DQ,Eduardo Garcia,Ferris,87.82,195.04,,,,Single-ply,SBD,M
Boys,99.79,1,Freddy Hernandez,Little Elm,95.25,229.06,149.69,235.87,614.62,Single-ply,SBD,M
Boys,99.79,2,Sir Wells,Lewisville The Colony,99.79,247.21,106.59,240.4,594.21,Single-ply,SBD,M
Boys,99.79,3,Isaiah Hinton,Lewisville The Colony,99.79,244.94,117.93,213.19,576.06,Single-ply,SBD,M
Boys,99.79,4,Matt Leise,Lewisville The Colony,99.79,235.87,124.74,204.12,564.72,Single-ply,SBD,M
Boys,99.79,5,Kyandrea Choice,Garland Sachse,96.43,185.97,131.54,231.33,548.85,Single-ply,SBD,M
Boys,99.79,6,Zac McCoy,Little Elm,99.52,210.92,136.08,199.58,546.58,Single-ply,SBD,M
Boys,99.79,7,Clay Eppler,Denison,99.79,206.38,124.74,206.38,537.51,Single-ply,SBD,M
Boys,99.79,8,Donovan Parker,North Mesquite,99.34,204.12,124.74,204.12,532.97,Single-ply,SBD,M
Boys,99.79,9,Tony Dwyer,Bishop Lynch,97.61,219.99,111.13,197.31,528.44,Single-ply,SBD,M
Boys,99.79,10,Jaden Stumbaugh,Denison,98.34,190.51,131.54,204.12,526.17,Single-ply,SBD,M
Boys,99.79,11,Andrew Abamu,Cedar Hill,98.34,206.38,97.52,215.46,519.36,Single-ply,SBD,M
Boys,99.79,12,Cory Smith,Cedar Hill,91.26,188.24,113.4,215.46,517.1,Single-ply,SBD,M
Boys,99.79,13,David Montenegro,Carrollton Turner,94.26,188.24,117.93,192.78,498.95,Single-ply,SBD,M
Boys,99.79,14,Ashton Thirkill,Cedar Hill,98.79,190.51,104.33,181.44,476.27,Single-ply,SBD,M
Boys,99.79,15,Will Mixon,Cedar Hill,95.71,142.88,115.67,181.44,439.98,Single-ply,SBD,M
Boys,99.79,16,Chase Ashworth,North Mesquite,99.52,145.15,92.99,172.37,410.5,Single-ply,SBD,M
Boys,99.79,17,Tyler Gardner,Carrollton Turner,98.52,142.88,97.52,163.29,403.7,Single-ply,SBD,M
Boys,99.79,18,Addison Schreffler,Frisco Centennial,96.16,117.93,88.45,142.88,349.27,Single-ply,SBD,M
Boys,99.79,19,Lohit Adusumilli,Frisco Heritage,97.07,102.06,74.84,122.47,299.37,Single-ply,SBD,M
Boys,99.79,DQ,Eli Zablosky,Bishop Lynch,90.99,88.45,,,,Single-ply,SBD,M
Boys,109.77,1,Tyrone Melton,Garland Sachse,106.23,244.94,154.22,240.4,639.57,Single-ply,SBD,M
Boys,124.74,2,Connor Counce,Denison,109.95,274.42,136.08,226.8,637.3,Single-ply,SBD,M
Boys,109.77,3,Axel DeLeon,Little Elm,100.79,242.67,136.08,229.06,607.81,Single-ply,SBD,M
Boys,109.77,4,Justin Taylor,Little Elm,106.14,235.87,145.15,226.8,607.81,Single-ply,SBD,M
Boys,109.77,5,Austin Apari,Lewisville The Colony,104.01,235.87,111.13,235.87,582.87,Single-ply,SBD,M
Boys,109.77,6,Kyle Flowers,Frisco Wakeland,104.24,224.53,133.81,199.58,557.92,Single-ply,SBD,M
Boys,109.77,7,Abel Palma,McKinney North,109.77,215.46,111.13,208.65,535.24,Single-ply,SBD,M
Boys,124.74,8,Jeremy Seligsohn,Frisco Wakeland,109.86,215.46,113.4,181.44,510.29,Single-ply,SBD,M
Boys,109.77,9,John Chesser,Denison,101.15,195.04,113.4,174.63,483.08,Single-ply,SBD,M
Boys,109.77,10,Dalton Soullas,Frisco Centennial,103.6,188.24,106.59,156.49,451.32,Single-ply,SBD,M
Boys,109.77,11,Erick Salazar,Carrollton Turner,104.69,151.95,92.99,163.29,408.23,Single-ply,SBD,M
Boys,109.77,12,Hector Ledezma,McKinney,102.33,151.95,99.79,147.42,399.16,Single-ply,SBD,M
Boys,109.77,DQ,Jeffrey Forst,Frisco Heritage,107.95,145.15,,,,Single-ply,SBD,M
Boys,124.74,1,Damarcus Henderson,Lewisville The Colony,124.74,235.87,122.47,226.8,585.13,Single-ply,SBD,M
Boys,124.74,2,Matt Guerra,Ferris,113.94,215.46,136.08,179.17,530.7,Single-ply,SBD,M
Boys,124.74,3,Daniel Kim,Lewisville The Colony,124.06,213.19,106.59,206.38,526.17,Single-ply,SBD,M
Boys,124.74,4,Jaleil Davis,Cedar Hill,111.13,201.85,124.74,185.97,512.56,Single-ply,SBD,M
Boys,124.74,5,Trey Marks,Little Elm,118.84,190.51,120.2,181.44,492.15,Single-ply,SBD,M
Boys,124.74,6,Simon Espinoza,Ferris,121.74,172.37,113.4,136.08,421.84,Single-ply,SBD,M
Boys,124.74,7,Nick Savala,Bishop Lynch,112.4,185.97,83.91,136.08,405.97,Single-ply,SBD,M
Boys,124.74,8,Micheal Williams,Frisco Heritage,112.67,136.08,81.65,124.74,342.46,Single-ply,SBD,M
Boys,124.74,9,Ivan Hernandez,Carrollton Turner,119.75,102.06,92.99,111.13,306.17,Single-ply,SBD,M
Boys,124.74,10,David Fraide,Carrollton Turner,113.4,131.54,52.16,111.13,294.84,Single-ply,SBD,M
Boys,124.74+,1,Jerome Daniels,Little Elm,134.44,272.16,172.37,222.26,666.78,Single-ply,SBD,M
Boys,124.74+,2,Abran Oakes,Garland Sachse,125.83,265.35,142.88,226.8,635.03,Single-ply,SBD,M
Boys,124.74+,3,Eric Nestares,North Mesquite,127.28,226.8,117.93,199.58,544.31,Single-ply,SBD,M
Boys,124.74+,4,Taylor Buchanan,Lewisville The Colony,125.19,199.58,113.4,226.8,539.77,Single-ply,SBD,M
Boys,124.74+,5,William Jones,Cedar Hill,130.45,215.46,145.15,163.29,523.9,Single-ply,SBD,M
Boys,124.74+,6,Matt Holmes,Frisco Centennial,135.26,208.65,131.54,167.83,508.02,Single-ply,SBD,M
Boys,124.74+,7,Josh Peterson,North Mesquite,130.91,213.19,108.86,176.9,498.95,Single-ply,SBD,M
Boys,124.74+,8,Josue Vargas,Ferris,142.16,229.06,97.52,158.76,485.34,Single-ply,SBD,M
Boys,124.74+,DQ,Conner Roarke,Carrollton Turner,125.92,156.49,,,,Single-ply,SBD,M
