Division,WeightClassKg,Place,Name,Team,BodyweightKg,Best3SquatKg,Best3BenchKg,Best3DeadliftKg,TotalKg,Equipment,Event,Sex
Girls,44.23,1,Erika Diaz,La Joya Palmview,42.37,106.59,58.97,106.59,272.16,Single-ply,SBD,F
Girls,44.23,2,Alysse Hernandez,La Joya Palmview,43.36,83.91,52.16,111.13,247.21,Single-ply,SBD,F
Girls,44.23,3,Destiny Perez,Rio Grande City Grulla,43.91,92.99,45.36,108.86,247.21,Single-ply,SBD,F
Girls,44.23,4,Soledad Lopez,McAllen Rowe,38.19,56.7,29.48,65.77,151.95,Single-ply,SBD,F
Girls,44.23,5,Analyssa Martinez,McAllen Rowe,44.09,52.16,22.68,77.11,151.95,Single-ply,SBD,F
Girls,47.85,1,Kayla Villarreal,Sharyland Pioneer,47.36,104.33,52.16,108.86,265.35,Single-ply,SBD,F
Girls,47.85,2,Daniela Plata,McAllen,47.45,102.06,38.56,97.52,238.14,Single-ply,SBD,F
Girls,47.85,3,Celeste Alvarez,Sharyland Pioneer,47.72,90.72,36.29,88.45,215.46,Single-ply,SBD,F
Girls,47.85,4,Kaitlyn Bryan,Mission Veterans Memorial,46.9,70.31,40.82,102.06,213.19,Single-ply,SBD,F
Girls,47.85,5,Matilde Garza,Rio Grande City,47.81,72.57,40.82,90.72,204.12,Single-ply,SBD,F
Girls,47.85,6,Neida Garza,Rio Grande City Grulla,45.09,45.36,24.95,49.9,120.2,Single-ply,SBD,F
Girls,47.85,DQ,Zuilmar Vasquez,McAllen Rowe,47.08,,,,,Single-ply,SBD,F
Girls,51.94,1,Ashley Tijerina,Mission Sharyland,51.8,156.49,70.31,149.69,376.48,Single-ply,SBD,F
Girls,51.94,2,Kimberely Rodriguez,Edinburg Economedes,50.35,124.74,74.84,124.74,324.32,Single-ply,SBD,F
Girls,51.94,3,Kc Aguilera,Mission,50.62,131.54,52.16,99.79,283.5,Single-ply,SBD,F
Girls,51.94,4,Lillian Serrano,Edcouch-Elsa,48.99,104.33,45.36,113.4,263.08,Single-ply,SBD,F
Girls,51.94,5,Victoria Fuentes,Rio Grande City,49.17,83.91,47.63,97.52,229.06,Single-ply,SBD,F
Girls,51.94,6,Gloria Fuentes,Rio Grande City,51.89,81.65,45.36,95.25,222.26,Single-ply,SBD,F
Girls,51.94,7,Alejandra Garcia,Sharyland Pioneer,51.94,81.65,34.02,79.38,195.04,Single-ply,SBD,F
Girls,51.94,8,Monica Flores,McAllen Rowe,49.62,65.77,31.75,88.45,185.97,Single-ply,SBD,F
Girls,51.94,9,Jaylea Guzman,Rio Grande City Grulla,51.89,68.04,27.22,79.38,174.63,Single-ply,SBD,F
Girls,51.94,DQ,Kayla Nino,McAllen Memorial,50.98,,,,,Single-ply,SBD,F
Girls,51.94,DQ,Deena Flores,Edcouch-Elsa,51.89,,,,,Single-ply,SBD,F
Girls,56.02,1,Katarina Moseley,McAllen,55.34,136.08,74.84,124.74,335.66,Single-ply,SBD,F
Girls,56.02,2,Sheyla Cantu,La Joya Juarez-Lincoln,54.66,111.13,58.97,115.67,285.76,Single-ply,SBD,F
Girls,56.02,3,Mariana Zarate,Mission Sharyland,55.25,113.4,52.16,120.2,285.76,Single-ply,SBD,F
Girls,56.02,4,Brenda Gazca,Rio Grande City,55.79,111.13,45.36,129.27,285.76,Single-ply,SBD,F
Girls,56.02,5,Alejandra Vasquez,Sharyland Pioneer,55.97,108.86,40.82,108.86,258.55,Single-ply,SBD,F
Girls,56.02,6,DeAndra Canales,Rio Grande City,52.8,95.25,45.36,115.67,256.28,Single-ply,SBD,F
Girls,56.02,7,Jenifer Martinez,Edcouch-Elsa,55.34,102.06,34.02,102.06,238.14,Single-ply,SBD,F
Girls,56.02,8,Anahy Garcia,Rio Grande City,54.88,104.33,43.09,88.45,235.87,Single-ply,SBD,F
Girls,56.02,9,Cassidy Gomez,McAllen Rowe,52.53,79.38,36.29,77.11,192.78,Single-ply,SBD,F
Girls,56.02,10,Issa Benavides,McAllen,55.43,83.91,40.82,65.77,190.51,Single-ply,SBD,F
Girls,56.02,11,Arelly Gonzalez,Mission Veterans Memorial,54.16,68.04,27.22,81.65,176.9,Single-ply,SBD,F
Girls,56.02,DQ,Josefina Bueno,McAllen Memorial,54.52,,,,,Single-ply,SBD,F
Girls,56.02,DQ,Donna Mondragon,La Joya Palmview,55.97,147.42,,,,Single-ply,SBD,F
Girls,56.02,DQ,Iliana Vasquez,Sharyland Pioneer,55.52,127.01,,,,Single-ply,SBD,F
Girls,60.1,1,Gisselle Cabrera,Edinburg Economedes,60.1,147.42,81.65,122.47,351.53,Single-ply,SBD,F
Girls,60.1,2,Ennette Diaz,La Joya Palmview,59.51,138.35,79.38,124.74,342.46,Single-ply,SBD,F
Girls,60.1,3,Valeria Guerra,Mission,58.42,131.54,63.5,133.81,328.85,Single-ply,SBD,F
Girls,60.1,4,Brianna Anzaldua,Sharyland Pioneer,57.79,117.93,52.16,124.74,294.84,Single-ply,SBD,F
Girls,60.1,5,Ashley Garcia,Rio Grande City,59.69,88.45,54.43,108.86,251.74,Single-ply,SBD,F
Girls,60.1,DQ,Shayla Reyna,Edcouch-Elsa,59.78,106.59,49.9,,,Single-ply,SBD,F
Girls,60.1,DQ,Gabby Trigo,La Joya Palmview,59.33,,,,,Single-ply,SBD,F
Girls,67.36,1,Brianna Flores,Mission Veterans Memorial,67.22,167.83,88.45,176.9,433.18,Single-ply,SBD,F
Girls,67.36,2,Princess Rios,Edinburg Economedes,63.14,147.42,83.91,136.08,367.41,Single-ply,SBD,F
Girls,67.36,3,Bianca Rosales,Mission,65.05,151.95,70.31,138.35,360.61,Single-ply,SBD,F
Girls,67.36,4,Jessica Montes,McAllen Memorial,64.77,149.69,61.23,122.47,333.39,Single-ply,SBD,F
Girls,67.36,5,Sofia Longoria,Mission Veterans Memorial,65.14,120.2,61.23,151.95,333.39,Single-ply,SBD,F
Girls,67.36,6,Briany Pena,La Joya Palmview,65.68,136.08,56.7,136.08,328.85,Single-ply,SBD,F
Girls,67.36,7,Alexia Rosas,La Joya Juarez-Lincoln,67.22,127.01,61.23,136.08,324.32,Single-ply,SBD,F
Girls,67.36,8,Aaliyah Logan,Mission,65.32,97.52,47.63,102.06,247.21,Single-ply,SBD,F
Girls,67.36,9,Rebecca Cavazos,McAllen Rowe,64.14,95.25,52.16,90.72,238.14,Single-ply,SBD,F
Girls,67.36,10,Aaliyah Aguirre,La Joya Juarez-Lincoln,63.14,83.91,49.9,86.18,219.99,Single-ply,SBD,F
Girls,67.36,11,Mya Belton,Mission,62.23,92.99,38.56,81.65,213.19,Single-ply,SBD,F
Girls,67.36,12,Yamilex Villarreal,Rio Grande City Grulla,61.23,81.65,31.75,79.38,192.78,Single-ply,SBD,F
Girls,67.36,DQ,Kassandra Mendiola,La Joya Palmview,65.68,,,,,Single-ply,SBD,F
Girls,67.36,DQ,Emily Longoria,Mission,63.32,127.01,,,,Single-ply,SBD,F
Girls,67.36,DQ,Julissa Juarez,Mission Sharyland,66.32,131.54,,,,Single-ply,SBD,F
Girls,75.07,1,Jennifer Perez,Edinburg Economedes,74.66,183.7,81.65,183.7,449.06,Single-ply,SBD,F
Girls,75.07,2,Alyssa Alvarado,McAllen Memorial,71.4,149.69,72.57,149.69,371.95,Single-ply,SBD,F
Girls,75.07,3,Arailey Garza,Edcouch-Elsa,75.02,154.22,83.91,129.27,367.41,Single-ply,SBD,F
Girls,75.07,4,Grabriela Mercado,Mission Sharyland,73.21,142.88,79.38,138.35,360.61,Single-ply,SBD,F
Girls,75.07,5,Monique Garza,McAllen,74.03,136.08,65.77,124.74,326.59,Single-ply,SBD,F
Girls,75.07,6,Brianna Flores,Rio Grande City,70.76,122.47,65.77,117.93,306.17,Single-ply,SBD,F
Girls,75.07,7,Monett Rodriguez,Sharyland Pioneer,73.21,136.08,56.7,111.13,303.91,Single-ply,SBD,F
Girls,75.07,8,Leslie Partida,La Joya Juarez-Lincoln,74.12,122.47,54.43,106.59,283.5,Single-ply,SBD,F
Girls,75.07,9,Laisha Rivas,Mission Veterans Memorial,70.85,108.86,56.7,102.06,267.62,Single-ply,SBD,F
Girls,75.07,10,Bryanna Lopez,Rio Grande City Grulla,72.03,113.4,45.36,97.52,256.28,Single-ply,SBD,F
Girls,75.07,11,Violette Bazan,Rio Grande City Grulla,73.84,104.33,38.56,106.59,249.48,Single-ply,SBD,F
Girls,75.07,DQ,Arlinda Cantu,Rio Grande City Grulla,68.76,,,,,Single-ply,SBD,F
Girls,75.07,DQ,Jacky Flores,Rio Grande City,67.86,92.99,43.09,,,Single-ply,SBD,F
Girls,75.07,DQ,Valerie Garza,Mission Veterans Memorial,71.58,74.84,45.36,,,Single-ply,SBD,F
Girls,75.07,DQ,Janel Olivera,Mission Veterans Memorial,72.12,102.06,52.16,,,Single-ply,SBD,F
Girls,75.07,DQ,Aylin Longoria,Mission Veterans Memorial,70.85,,,,,Single-ply,SBD,F
Girls,82.33,1,Jeweliana Rosas,La Joya Juarez-Lincoln,80.83,158.76,81.65,154.22,394.63,Single-ply,SBD,F
Girls,82.33,2,Leslie Garcia,Edinburg Economedes,81.28,158.76,83.91,142.88,385.55,Single-ply,SBD,F
Girls,82.33,3,Nira Hinojosa,La Joya Palmview,82.28,138.35,61.23,140.61,340.19,Single-ply,SBD,F
Girls,82.33,4,Mildred Lugo,Edcouch-Elsa,76.11,113.4,68.04,117.93,299.37,Single-ply,SBD,F
Girls,82.33,5,Micaela Flores,Mission Veterans Memorial,79.06,120.2,68.04,111.13,299.37,Single-ply,SBD,F
Girls,82.33,DQ,Carolina Constantino,Mission Sharyland,79.02,170.1,,,,Single-ply,SBD,F
Girls,82.33,DQ,Katrina Mendez,Mission Sharyland,82.28,183.7,102.06,,,Single-ply,SBD,F
Girls,82.33,DQ,Sabrena Rosales,Edinburg Economedes,77.66,,,,,Single-ply,SBD,F
Girls,82.33,DQ,Diony Villanueva,Edinburg Economedes,77.84,,,,,Single-ply,SBD,F
Girls,82.33,DQ,Laura Mendoza,Sharyland Pioneer,77.56,104.33,47.63,,,Single-ply,SBD,F
Girls,90.04,1,D'Andra Gaitan,Edinburg Economedes,89.9,208.65,117.93,165.56,492.15,Single-ply,SBD,F
Girls,90.04,2,Neylie Chavez,La Joya Juarez-Lincoln,89.81,156.49,81.65,142.88,381.02,Single-ply,SBD,F
Girls,90.04,3,Alexia Guerrero,McAllen,87.27,124.74,77.11,124.74,326.59,Single-ply,SBD,F
Girls,90.04,4,Sophia Handy,McAllen,87.18,138.35,68.04,115.67,322.05,Single-ply,SBD,F
Girls,90.04,5,Beth Moreno,McAllen Rowe,86.09,129.27,54.43,127.01,310.71,Single-ply,SBD,F
Girls,90.04,6,Sydney Reyes,McAllen,89.63,120.2,74.84,,195.04,Single-ply,SB,F
Girls,100.02,1,Juana Bolanos,Edinburg Economedes,97.52,174.63,102.06,127.01,403.7,Single-ply,SBD,F
Girls,100.02,2,Esthela Prado,McAllen Memorial,94.08,142.88,58.97,127.01,328.85,Single-ply,SBD,F
Girls,100.02,DQ,Angellie Macias,McAllen Rowe,99.52,154.22,72.57,,,Single-ply,SBD,F
Girls,100.02,DQ,Erika Guerrero,Mission,99.79,201.85,68.04,,,Single-ply,SBD,F
Girls,100.02,DQ,Evelyn Garza,Edcouch-Elsa,98.52,,,,,Single-ply,SBD,F
Girls,117.71,1,Jazzmine Barrera,Edcouch-Elsa,116.12,222.26,97.52,183.7,503.49,Single-ply,SBD,F
Girls,117.71,2,Leah Cantu,McAllen Memorial,113.49,170.1,97.52,136.08,403.7,Single-ply,SBD,F
Girls,117.71,3,America Alvarez,McAllen,102.51,133.81,74.84,106.59,315.25,Single-ply,SBD,F
Girls,117.71,4,Tara Torres,McAllen,107.05,136.08,61.23,99.79,297.1,Single-ply,SBD,F
