Lot;Group;Lifter name;Gender;Birth year;B.W.;Coefficient;Věkový koeficient;Start day;Nation;Club name;Contingent;Team;Competition category;Weight category;Age category;Catgeory flags;Racks for squat;Racks for bench;SQ (nominace);PC (SQ, nominace);SQ1;SQ2;SQ3;SQ4R;SQ;SQ (prognose);Place (SQ);Place (SQ, prognose);Reshel (SQ);R+F/MC (SQ);Reshel (SQ, prognose);R+F/MC (SQ, prognose);Absolute place (SQ);Absolute place (SQ, prognose);PC (SQ);PC (SQ, prognose);Total (nominace);PC (Total, nominace);Total;Total (prognose);Place (Total);Place (Total, prognose);Reshel (Total);R+F/MC (Total);Reshel (Total, prognose);R+F/MC (Total, prognose);Absolute place (Total);Absolute place (Total, prognose);PC (Total);PC (Total, prognose);Division;Status
KATEGORIJSKA SQUAT RAW;;;;;;;;;;;;;;;;;;;;;;;;;;;;;;;;;;;;;;;;;;;;;;;;;;;;
75;;SEJFO Sehović;M;1959;72.70;1.1518;1.2970;4/1/2017 8:00 AM;BOSNIA & HERZEGOVINA;;;;Men M1 -75kg RAW;-75.0;Masters1;RAW;;;;;-160.0;160.0;170.0;;170.0;170.0;1;1;195.8060;253.9604;195.8060;253.9604;;;;;;;170.0;170.0;1;1;195.8060;253.9604;195.8060;253.9604;;;;;M4;OK
;;SANEL Čičić;M;1993;74.90;1.1182;;4/1/2017 8:00 AM;SERBIA;;;;Juniors -75kg RAW;-75.0;J;RAW;;;;;160.0;180.0;195.0;;195.0;195.0;1;1;218.0490;218.0490;218.0490;218.0490;;;;;;;195.0;195.0;1;1;218.0490;218.0490;218.0490;218.0490;;;;;J;OK
82.5;;STEFAN Kašiković;M;1997;81.70;1.0366;1.0400;4/1/2017 8:00 AM;BOSNIA & HERZEGOVINA;;;;Juniors -82.5kg RAW;-82.5;J;RAW;;;;;180.0;-200.0;205.0;;205.0;205.0;1;1;212.5030;221.0031;212.5030;221.0031;;;;;;;205.0;205.0;1;1;212.5030;221.0031;212.5030;221.0031;;;;;T3;OK
90;;EJUB Baltić;M;1991;87.60;0.9862;;4/1/2017 8:00 AM;BOSNIA & HERZEGOVINA;;;;Men -90kg RAW;-90.0;Seniors;RAW;;;;;150.0;-165.0;170.0;;170.0;170.0;1;1;167.6540;167.6540;167.6540;167.6540;;;;;;;170.0;170.0;1;1;167.6540;167.6540;167.6540;167.6540;;;;;O;OK
100;;ADI Lojo  ;M;1982;99.35;0.9174;;4/1/2017 8:00 AM;BOSNIA & HERZEGOVINA;;;;Men -100kg RAW;-100.0;Seniors;RAW;;;;;210.0;-230.0;230.0;;230.0;230.0;1;1;211.0020;211.0020;211.0020;211.0020;;;;;;;230.0;230.0;1;1;211.0020;211.0020;211.0020;211.0020;;;;;O;OK
;;;;;;;;;;;;;;;;;;;;;;;;;;;;;;;;;;;;;;;;;;;;;;;;;;;;