Division,WeightClassKg,Place,Name,Team,BodyweightKg,Best3SquatKg,Best3BenchKg,Best3DeadliftKg,TotalKg,Equipment,Event,Sex
Boys,51.71,1,Nathan Sylakhom,Fort Worth Boswell,51.07,111.13,52.16,138.35,301.64,Single-ply,SBD,M
Boys,51.71,2,Julian Carbajal,Fort Worth Paschal,51.07,102.06,63.5,115.67,281.23,Single-ply,SBD,M
Boys,51.71,3,Decker Winfrey,Azle,44.91,77.11,47.63,86.18,210.92,Single-ply,SBD,M
Boys,51.71,4,Logan Thomas,Aledo,45.9,68.04,47.63,95.25,210.92,Single-ply,SBD,M
Boys,55.79,1,Arlind Queriman,Aledo,55.38,170.1,106.59,147.42,424.11,Single-ply,SBD,M
Boys,55.79,2,Anthony Phimmasone,Fort Worth Boswell,54.88,151.95,79.38,170.1,401.43,Single-ply,SBD,M
Boys,55.79,3,Otis Jackson,Aledo,55.79,113.4,79.38,122.47,315.25,Single-ply,SBD,M
Boys,55.79,4,John Davis,White Settlement Brewer,53.25,113.4,61.23,117.93,292.57,Single-ply,SBD,M
Boys,55.79,5,Samuel Eggeston,Saginaw,54.7,102.06,54.43,108.86,265.35,Single-ply,SBD,M
Boys,55.79,6,Jacob Densmore,Fort Worth Chisholm Trail,55.29,97.52,58.97,106.59,263.08,Single-ply,SBD,M
Boys,55.79,DQ,Braeden Knoll,Azle,55.66,129.27,,,,Single-ply,SBD,M
Boys,59.87,1,Hunter Martin,Azle,59.01,136.08,74.84,161.03,371.95,Single-ply,SBD,M
Boys,59.87,2,Julian Castano,Fort Worth Boswell,58.6,124.74,77.11,154.22,356.07,Single-ply,SBD,M
Boys,59.87,3,Steven Burns,Aledo,59.15,127.01,79.38,145.15,351.53,Single-ply,SBD,M
Boys,59.87,4,Joel Rayos,Springtown,59.69,115.67,81.65,151.95,349.27,Single-ply,SBD,M
Boys,59.87,5,Julian Lucignani,Fort Worth Paschal,59.87,102.06,56.7,136.08,294.84,Single-ply,SBD,M
Boys,67.13,1,Garrett Wright,Fort Worth Boswell,67.04,185.97,113.4,188.24,487.61,Single-ply,SBD,M
Boys,67.13,2,Davonte Green,Fort Worth Chisholm Trail,67.13,154.22,83.91,188.24,426.38,Single-ply,SBD,M
Boys,67.13,3,Colt Edwards,Fort Worth Boswell,65.32,174.63,95.25,151.95,421.84,Single-ply,SBD,M
Boys,67.13,4,Dane Dorris,Azle,63.5,158.76,83.91,147.42,390.09,Single-ply,SBD,M
Boys,67.13,5,Zaid Mares,White Settlement Brewer,61.51,81.65,72.57,102.06,256.28,Single-ply,SBD,M
Boys,67.13,DQ,Gavin Johnson,Saginaw,67.13,131.54,,,,Single-ply,SBD,M
Boys,74.84,1,Tatum Price,Aledo,73.84,204.12,120.2,201.85,526.17,Single-ply,SBD,M
Boys,74.84,2,Xavier Lozano,Fort Worth Boswell,72.21,170.1,111.13,192.78,474,Single-ply,SBD,M
Boys,74.84,3,Ndedseh Nchopa,Fort Worth Chisholm Trail,71.62,161.03,102.06,195.04,458.13,Single-ply,SBD,M
Boys,74.84,4,Brendan Chism,Granbury,73.66,158.76,111.13,188.24,458.13,Single-ply,SBD,M
Boys,74.84,5,Mariano Arriaga,Aledo,73.35,156.49,111.13,174.63,442.25,Single-ply,SBD,M
Boys,74.84,6,Micheal Brewer,Saginaw,72.57,170.1,111.13,154.22,435.45,Single-ply,SBD,M
Boys,74.84,7,JeShaun Patton,White Settlement Brewer,73.39,181.44,83.91,167.83,433.18,Single-ply,SBD,M
Boys,74.84,8,Xavier Clark,Fort Worth Chisholm Trail,74.3,147.42,88.45,170.1,405.97,Single-ply,SBD,M
Boys,74.84,9,Michael Jones-Bradley,Saginaw,68.49,154.22,79.38,170.1,403.7,Single-ply,SBD,M
Boys,74.84,10,Thomas Jarrett,Fort Worth Paschal,68.49,138.35,86.18,170.1,394.63,Single-ply,SBD,M
Boys,74.84,11,Jason Arrellano,Azle,73.3,158.76,79.38,154.22,392.36,Single-ply,SBD,M
Boys,74.84,12,Eric Trevino,Fort Worth Paschal,70.76,145.15,74.84,170.1,390.09,Single-ply,SBD,M
Boys,74.84,13,Carlos Ortiz,Fort Worth Paschal,69.76,142.88,86.18,154.22,383.29,Single-ply,SBD,M
Boys,82.1,1,Jorden Wilkerson,Granbury,79.97,217.72,147.42,226.8,591.94,Single-ply,SBD,M
Boys,82.1,2,Jordan McNeely,Azle,80.6,204.12,136.08,226.8,566.99,Single-ply,SBD,M
Boys,82.1,3,Zach Watson,Springtown,81.78,210.92,136.08,195.04,542.04,Single-ply,SBD,M
Boys,82.1,4,Grayson Porche,Aledo,78.29,195.04,136.08,204.12,535.24,Single-ply,SBD,M
Boys,82.1,5,Hayden Davidson,Azle,81.74,206.38,102.06,208.65,517.1,Single-ply,SBD,M
Boys,82.1,6,Cameron Harmon,Azle,81.15,204.12,113.4,190.51,508.02,Single-ply,SBD,M
Boys,82.1,7,Jaquan Cummings,Springtown,81.65,156.49,108.86,210.92,476.27,Single-ply,SBD,M
Boys,82.1,8,Tavish McCain,White Settlement Brewer,77.29,172.37,113.4,188.24,474,Single-ply,SBD,M
Boys,82.1,9,Weston Reese,Aledo,81.01,163.29,120.2,185.97,469.47,Single-ply,SBD,M
Boys,82.1,10,Bradey Rhodes,Springtown,78.38,172.37,106.59,188.24,467.2,Single-ply,SBD,M
Boys,82.1,11,Tyler Sarreara,White Settlement Brewer,79.38,156.49,108.86,165.56,430.91,Single-ply,SBD,M
Boys,82.1,12,Andrue Monrreal,Fort Worth Chisholm Trail,76.29,142.88,90.72,192.78,426.38,Single-ply,SBD,M
Boys,82.1,13,Mario Marroquin,Fort Worth Chisholm Trail,79.02,151.95,83.91,165.56,401.43,Single-ply,SBD,M
Boys,82.1,14,Ben Larson,Fort Worth Paschal,77.29,151.95,79.38,167.83,399.16,Single-ply,SBD,M
Boys,82.1,15,Isaac Garcia,Fort Worth Paschal,75.66,106.59,49.9,115.67,272.16,Single-ply,SBD,M
Boys,89.81,1,Guillermo Pando,Springtown,88.95,217.72,154.22,213.19,585.13,Single-ply,SBD,M
Boys,89.81,2,Luis Hernandez,Granbury,89.09,226.8,140.61,217.72,585.13,Single-ply,SBD,M
Boys,89.81,3,Jared Wheeler,Azle,88.77,192.78,136.08,215.46,544.31,Single-ply,SBD,M
Boys,89.81,4,Michael Trull,Granbury,89.27,201.85,136.08,206.38,544.31,Single-ply,SBD,M
Boys,89.81,5,Carson Cato,White Settlement Brewer,87.09,174.63,120.2,197.31,492.15,Single-ply,SBD,M
Boys,89.81,6,Tevin Odongo,Fort Worth Chisholm Trail,84.28,161.03,102.06,199.58,462.66,Single-ply,SBD,M
Boys,99.79,1,Andrew Lutz,Azle,97.93,233.6,129.27,204.12,566.99,Single-ply,SBD,M
Boys,99.79,2,Tyler Walker,Granbury,92.85,217.72,136.08,208.65,562.45,Single-ply,SBD,M
Boys,99.79,3,Colton Kelley,Granbury,98.16,195.04,127.01,235.87,557.92,Single-ply,SBD,M
Boys,99.79,4,Carlos Hernandez,Saginaw,98.29,231.33,122.47,204.12,557.92,Single-ply,SBD,M
Boys,99.79,5,Terrance Wair,Fort Worth Boswell,95.62,190.51,124.74,235.87,551.11,Single-ply,SBD,M
Boys,99.79,6,Seth Thompson,White Settlement Brewer,97.79,201.85,131.54,210.92,544.31,Single-ply,SBD,M
Boys,99.79,7,Will Humphrey,Fort Worth Boswell,97.7,215.46,122.47,199.58,537.51,Single-ply,SBD,M
Boys,99.79,8,Landon Rhoades,Saginaw,99.38,201.85,104.33,199.58,505.76,Single-ply,SBD,M
Boys,99.79,9,Tyler Lungraj,Saginaw,92.8,183.7,102.06,183.7,469.47,Single-ply,SBD,M
Boys,99.79,10,Brent Rose,Springtown,96.16,158.76,111.13,174.63,444.52,Single-ply,SBD,M
Boys,99.79,11,Hunter Baldwin,Springtown,98.7,154.22,97.52,156.49,408.23,Single-ply,SBD,M
Boys,99.79,DQ,Felix Rodriguez,Fort Worth Paschal,99.43,163.29,74.84,,,Single-ply,SBD,M
Boys,109.77,1,Jason Umanzor,Granbury,104.51,278.96,156.49,242.67,678.12,Single-ply,SBD,M
Boys,109.77,2,Travis Williams,Fort Worth Chisholm Trail,107.95,242.67,147.42,229.06,619.15,Single-ply,SBD,M
Boys,109.77,3,Tyler Jensen,Azle,106.87,215.46,154.22,195.04,564.72,Single-ply,SBD,M
Boys,109.77,4,Fernando Torres,Saginaw,109.77,235.87,131.54,197.31,564.72,Single-ply,SBD,M
Boys,109.77,5,Michael Pollard,Fort Worth Boswell,107.59,226.8,115.67,204.12,546.58,Single-ply,SBD,M
Boys,109.77,6,Alexis Trejo,Saginaw,108.95,204.12,129.27,195.04,528.44,Single-ply,SBD,M
Boys,109.77,7,Blake Price,Aledo,107.5,219.99,122.47,183.7,526.17,Single-ply,SBD,M
Boys,109.77,8,Christian Klumpp,White Settlement Brewer,108.14,163.29,120.2,183.7,467.2,Single-ply,SBD,M
Boys,109.77,9,Case Mason,Saginaw,107.5,174.63,99.79,188.24,462.66,Single-ply,SBD,M
Boys,109.77,10,Martin Guiterez,Springtown,100.52,156.49,117.93,183.7,458.13,Single-ply,SBD,M
Boys,124.74,1,Raul Sandoval,Granbury,113.9,285.76,181.44,258.55,725.75,Single-ply,SBD,M
Boys,124.74,2,Max Michaels,Fort Worth Boswell,121.43,219.99,165.56,226.8,612.35,Single-ply,SBD,M
Boys,124.74,3,Zacc Haynes,Aledo,118.21,249.48,140.61,192.78,582.87,Single-ply,SBD,M
Boys,124.74,4,Skylar Ochoa,Granbury,113.4,201.85,142.88,213.19,557.92,Single-ply,SBD,M
Boys,124.74,5,Logan Escamilla,Aledo,121.65,206.38,147.42,204.12,557.92,Single-ply,SBD,M
Boys,124.74,6,Isaac Vielma,White Settlement Brewer,111.49,226.8,115.67,197.31,539.77,Single-ply,SBD,M
Boys,124.74,7,Mav Roberts,White Settlement Brewer,112.49,190.51,104.33,226.8,521.63,Single-ply,SBD,M
Boys,124.74,8,Demetrius Winkfield,Fort Worth Chisholm Trail,115.85,174.63,113.4,190.51,478.54,Single-ply,SBD,M
Boys,124.74,9,Sebastian Saucedo,Fort Worth Chisholm Trail,122.38,161.03,106.59,197.31,464.93,Single-ply,SBD,M
Boys,124.74,10,Tyler Allison,Springtown,112.13,151.95,104.33,170.1,426.38,Single-ply,SBD,M
Boys,124.74+,1,Jonathan Sutton,Granbury,127.5,244.94,156.49,244.94,646.37,Single-ply,SBD,M
Boys,124.74+,2,Adrian Little,Saginaw,149.23,247.21,138.35,195.04,580.6,Single-ply,SBD,M
Boys,124.74+,3,Alexander Frithiof,Springtown,125.69,204.12,142.88,192.78,539.77,Single-ply,SBD,M
Boys,124.74+,4,James Ybarra,Fort Worth Chisholm Trail,141.97,197.31,115.67,192.78,505.76,Single-ply,SBD,M
Boys,124.74+,5,Koltin Bush,Granbury,126.73,181.44,127.01,185.97,494.42,Single-ply,SBD,M
Boys,124.74+,6,Aidan Tremaine,Fort Worth Boswell,135.44,181.44,95.25,163.29,439.98,Single-ply,SBD,M
