Division,WeightClassKg,Place,Name,Team,BodyweightKg,Best3SquatKg,Best3BenchKg,Best3DeadliftKg,TotalKg,Equipment,Event,Sex
Girls,44.23,1,Lauren Aldape,Mercedes,42.64,115.67,54.43,127.01,297.1,Single-ply,SBD,F
Girls,44.23,2,Ashley Martinez,Edinburg Idea College Prep,42.64,120.2,45.36,129.27,294.84,Single-ply,SBD,F
Girls,44.23,3,Natalie Pruneda,Pharr Valley View,42.37,90.72,38.56,106.59,235.87,Single-ply,SBD,F
Girls,44.23,4,Nadia Rodriguez,Hidalgo Early College,43.27,86.18,36.29,92.99,215.46,Single-ply,SBD,F
Girls,44.23,NS,Aracely Juarez,Hidalgo Early College,,,,,,Single-ply,SBD,F
Girls,44.23,DQ,Arely Ortega,Edinburg Quest College Prep,43.54,,,,,Single-ply,SBD,F
Girls,44.23,DQ,Karina Martinez,Edinburg Quest College Prep,42,,,,,Single-ply,SBD,F
Girls,44.23,DQ,Adriana Villafuerte,Edinburg Idea College Prep,43.54,97.52,,,,Single-ply,SBD,F
Girls,44.23,DQ,Destiny Loredo,Edcouch-Elsa,41.28,,,,,Single-ply,SBD,F
Girls,44.23,DQ,Dulce Ibanez,Edcouch-Elsa,44,,,,,Single-ply,SBD,F
Girls,47.85,1,Evelyn Hernandez,Weslaco East,47.08,131.54,43.09,129.27,303.91,Single-ply,SBD,F
Girls,47.85,2,Diamond Teran,Hidalgo Early College,46.9,111.13,49.9,120.2,281.23,Single-ply,SBD,F
Girls,47.85,3,Yliana Beltran,Donna,45.36,113.4,56.7,106.59,276.69,Single-ply,SBD,F
Girls,47.85,4,Giselle De La Garza,Pharr Valley View,47.22,102.06,49.9,106.59,258.55,Single-ply,SBD,F
Girls,47.85,5,Stephanie Martinez,Weslaco East,46.18,113.4,47.63,90.72,251.74,Single-ply,SBD,F
Girls,47.85,6,Amber Trevino,Edinburg Quest College Prep,47.54,88.45,61.23,97.52,247.21,Single-ply,SBD,F
Girls,47.85,7,Alejandra Garcia,Edinburg Quest College Prep,47.08,92.99,36.29,104.33,233.6,Single-ply,SBD,F
Girls,47.85,8,America Navarro,Pharr Valley View,46.4,68.04,45.36,95.25,208.65,Single-ply,SBD,F
Girls,47.85,9,Monserrat Collado,Pharr Valley View,47.26,79.38,38.56,79.38,197.31,Single-ply,SBD,F
Girls,47.85,10,Krista Garcia,Edinburg Idea College Prep,47.17,65.77,22.68,61.23,149.69,Single-ply,SBD,F
Girls,47.85,DQ,Francell Menendez,Edinburg Quest College Prep,46.36,,,,,Single-ply,SBD,F
Girls,47.85,DQ,Andrea Mendoza,Donna North,46.27,86.18,,,,Single-ply,SBD,F
Girls,47.85,DQ,Valeria Perez,Weslaco East,47.08,,,,,Single-ply,SBD,F
Girls,47.85,DQ,Brianna Gutirerrez,Mercedes,47.81,,,,,Single-ply,SBD,F
Girls,47.85,NS,Nicole Birney,La Feria,,,,,,Single-ply,SBD,F
Girls,51.94,1,Nicole Rodriguez,Donna North,51.26,99.79,52.16,124.74,276.69,Single-ply,SBD,F
Girls,51.94,2,Audrey Gutierrez,Pharr Valley View,51.17,102.06,49.9,117.93,269.89,Single-ply,SBD,F
Girls,51.94,3,Jazmin Sanchez,Edcouch-Elsa,51.71,113.4,47.63,102.06,263.08,Single-ply,SBD,F
Girls,51.94,4,Elizabeth Hernandez,Hidalgo Early College,51.89,77.11,40.82,99.79,217.72,Single-ply,SBD,F
Girls,51.94,5,Tiffany Olvera,Pharr Valley View,51.21,61.23,31.75,63.5,156.49,Single-ply,SBD,F
Girls,51.94,DQ,Luna Garcia,Pharr Valley View,51.8,83.91,,,,Single-ply,SBD,F
Girls,56.02,1,Corina Yanez,Donna,54.43,158.76,77.11,136.08,371.95,Single-ply,SBD,F
Girls,56.02,2,Cristy Gonzalez,Edinburg Idea College Prep,53.98,129.27,65.77,131.54,326.59,Single-ply,SBD,F
Girls,56.02,3,Jenacy Avitia,Donna North,54.88,129.27,70.31,127.01,326.59,Single-ply,SBD,F
Girls,56.02,4,Jocelyn Martinez,Pharr Valley View,55.38,129.27,45.36,138.35,312.98,Single-ply,SBD,F
Girls,56.02,5,Janice Fan,Weslaco East,55.88,127.01,45.36,127.01,299.37,Single-ply,SBD,F
Girls,56.02,6,Danielle Rocha,Donna North,55.34,122.47,54.43,117.93,294.84,Single-ply,SBD,F
Girls,56.02,7,Kayla Trevino,Mercedes,55.16,111.13,43.09,122.47,276.69,Single-ply,SBD,F
Girls,56.02,8,Gloria Betancourt,Hidalgo Early College,55.7,111.13,45.36,120.2,276.69,Single-ply,SBD,F
Girls,56.02,9,Jayda Medina,Edcouch-Elsa,55.79,122.47,38.56,102.06,263.08,Single-ply,SBD,F
Girls,56.02,10,Jannay Garcia,Mercedes,52.8,108.86,47.63,102.06,258.55,Single-ply,SBD,F
Girls,56.02,11,Wendy Olivarez,Weslaco East,55.16,104.33,38.56,106.59,249.48,Single-ply,SBD,F
Girls,56.02,12,Alyzza Ortiz,Edinburg Quest College Prep,55.25,79.38,47.63,92.99,219.99,Single-ply,SBD,F
Girls,56.02,DQ,Vanessa Lucio,La Feria,53.89,58.97,27.22,,,Single-ply,SBD,F
Girls,56.02,DQ,Destini Thomas,Donna,55.34,113.4,70.31,,,Single-ply,SBD,F
Girls,56.02,NS,Ivy Santiago,Edinburg Quest College Prep,,,,,,Single-ply,SBD,F
Girls,60.1,1,Jiulda Villalobos,Hidalgo Early College,58.15,158.76,90.72,136.08,385.55,Single-ply,SBD,F
Girls,60.1,2,Karen Martinez,Donna,59.42,147.42,65.77,151.95,365.14,Single-ply,SBD,F
Girls,60.1,3,Amanda Olivarez,Donna North,59.87,145.15,74.84,136.08,356.07,Single-ply,SBD,F
Girls,60.1,4,Kimberly Ramos,Donna North,57.61,95.25,52.16,115.67,263.08,Single-ply,SBD,F
Girls,60.1,5,Ruth Avila,Edinburg Quest College Prep,59.51,86.18,43.09,113.4,242.67,Single-ply,SBD,F
Girls,60.1,DQ,Devina Garcia,Mercedes,58.69,54.43,,,,Single-ply,SBD,F
Girls,60.1,NS,Kassidy Sanchez,Mercedes,,,,,,Single-ply,SBD,F
Girls,67.36,1,Frida Olarte,Hidalgo Early College,66.77,147.42,81.65,131.54,360.61,Single-ply,SBD,F
Girls,67.36,2,Dalila Sanchez,Donna North,66.68,151.95,63.5,140.61,356.07,Single-ply,SBD,F
Girls,67.36,3,Josie Munoz,Weslaco East,64.5,156.49,61.23,117.93,335.66,Single-ply,SBD,F
Girls,67.36,4,Bianca Aguirre,Donna North,66.22,127.01,47.63,117.93,292.57,Single-ply,SBD,F
Girls,67.36,5,Stephanie Reyes,La Feria,66.86,115.67,49.9,108.86,274.42,Single-ply,SBD,F
Girls,67.36,6,Natalia Marquez,Mercedes,61.78,102.06,45.36,124.74,272.16,Single-ply,SBD,F
Girls,67.36,7,Virginia Galvan,La Feria,66.41,102.06,49.9,111.13,263.08,Single-ply,SBD,F
Girls,67.36,8,Yvette Solis,Donna,62.14,102.06,40.82,90.72,233.6,Single-ply,SBD,F
Girls,67.36,DQ,Raven Dena,Mercedes,64.5,,,,,Single-ply,SBD,F
Girls,67.36,DQ,Nicole Anderson,Pharr Valley View,66.95,,,,,Single-ply,SBD,F
Girls,75.07,1,Mackenzie Contreras,Edcouch-Elsa,74.84,147.42,70.31,149.69,367.41,Single-ply,SBD,F
Girls,75.07,2,Jessica Saenz,Donna North,73.48,147.42,72.57,145.15,365.14,Single-ply,SBD,F
Girls,75.07,3,Jozlyn Lara,Edcouch-Elsa,70.76,145.15,58.97,151.95,356.07,Single-ply,SBD,F
Girls,75.07,4,Arrianna Guerra,Donna,73.03,124.74,49.9,136.08,310.71,Single-ply,SBD,F
Girls,75.07,5,Gabby Torres,La Feria,70.58,90.72,38.56,117.93,247.21,Single-ply,SBD,F
Girls,82.33,1,Alyssa Juarez,Weslaco East,79.2,170.1,88.45,147.42,405.97,Single-ply,SBD,F
Girls,82.33,2,Angela Rendon,Hidalgo Early College,81.65,179.17,72.57,142.88,394.63,Single-ply,SBD,F
Girls,82.33,3,Brittany Garza,Donna,80.74,129.27,61.23,113.4,303.91,Single-ply,SBD,F
Girls,82.33,4,Amabella Gonzalez,Pharr Valley View,81.83,120.2,52.16,129.27,301.64,Single-ply,SBD,F
Girls,90.04,1,Kaylee Lopez,Donna,84.37,140.61,72.57,133.81,347,Single-ply,SBD,F
Girls,90.04,2,Tiffani Gonzalez,Donna North,89.36,131.54,77.11,124.74,333.39,Single-ply,SBD,F
Girls,90.04,3,Landry Munoz,Weslaco East,87.36,142.88,61.23,108.86,312.98,Single-ply,SBD,F
Girls,90.04,4,Nadia Cuellar,Hidalgo Early College,87.36,120.2,65.77,122.47,308.44,Single-ply,SBD,F
Girls,90.04,5,Rachel Canche,Donna,88.45,120.2,45.36,102.06,267.62,Single-ply,SBD,F
Girls,90.04,6,Mariela Herreran,Pharr Valley View,89.22,92.99,54.43,120.2,267.62,Single-ply,SBD,F
Girls,90.04,7,Zelyn de la Cruz,La Feria,84.19,70.31,58.97,122.47,251.74,Single-ply,SBD,F
Girls,90.04,DQ,Alexandra Hall,Edinburg Quest College Prep,87.54,,,,,Single-ply,SBD,F
Girls,90.04,DQ,Destinee Perez,Mercedes,88.54,,,,,Single-ply,SBD,F
Girls,90.04,DQ,Sadie Granados,Edcouch-Elsa,89.81,,,,,Single-ply,SBD,F
Girls,90.04,DQ,Priscilla Garza,Edinburg Idea College Prep,82.37,147.42,61.23,,,Single-ply,SBD,F
Girls,100.02,1,Carolina De Leon,Weslaco East,94.17,204.12,86.18,170.1,460.4,Single-ply,SBD,F
Girls,100.02,2,Yasmine Perez,La Feria,95.25,179.17,86.18,154.22,419.57,Single-ply,SBD,F
Girls,100.02,3,Brenda Lopez,Pharr Valley View,96.21,149.69,95.25,142.88,387.82,Single-ply,SBD,F
Girls,100.02,4,Damarys Salazar,Donna North,96.16,154.22,83.91,138.35,376.48,Single-ply,SBD,F
Girls,100.02,DQ,Leann Rodriguez,Weslaco East,95.07,165.56,58.97,,,Single-ply,SBD,F
Girls,117.71,1,Arely Rincon,Weslaco East,115.94,158.76,97.52,124.74,381.02,Single-ply,SBD,F
Girls,117.71,2,Emily Martinez,Hidalgo Early College,103.78,158.76,65.77,127.01,351.53,Single-ply,SBD,F
Girls,117.71,3,Mariah Padron,Donna,102.97,151.95,72.57,124.74,349.27,Single-ply,SBD,F
Girls,117.71,4,Desiree Perez,La Feria,103.15,136.08,58.97,138.35,333.39,Single-ply,SBD,F
Girls,117.71,5,Roxanne Martinez,Donna,101.6,158.76,61.23,104.33,324.32,Single-ply,SBD,F
Girls,117.71,DQ,Jazzmine Barerra,Edcouch-Elsa,104.33,156.49,,,,Single-ply,SBD,F
Girls,117.71,DQ,Monika Moralez,Edinburg Idea College Prep,106.59,145.15,65.77,,,Single-ply,SBD,F
Girls,117.71+,1,Melissa Morales,Weslaco East,122.83,256.28,124.74,183.7,564.72,Single-ply,SBD,F
Girls,117.71+,2,Alyssa Silva,Hidalgo Early College,148.51,138.35,86.18,142.88,367.41,Single-ply,SBD,F
Girls,117.71+,3,Victoria Casares,Donna,123.38,170.1,56.7,136.08,362.87,Single-ply,SBD,F
Girls,117.71+,4,Kim Riojas,Mercedes,117.93,122.47,54.43,140.61,317.51,Single-ply,SBD,F
