Division,WeightClassKg,Place,Name,Team,BodyweightKg,Best3SquatKg,Best3BenchKg,Best3DeadliftKg,TotalKg,Equipment,Event,Sex
Boys,55.79,1,Jon Mora,Bishop Lynch,51.94,136.08,58.97,149.69,344.73,Single-ply,SBD,M
Boys,55.79,1,Anthony Mullins,Bishop Lynch,54.88,124.74,56.7,136.08,317.51,Single-ply,SBD,M
Boys,55.79,2,Nate Tarpley,Fort Worth Trimble Tech,53.3,113.4,56.7,129.27,299.37,Single-ply,SBD,M
Boys,55.79,3,Jerimah Mask,Bishop Lynch,55.34,129.27,45.36,124.74,299.37,Single-ply,SBD,M
Boys,55.79,4,Jose Rodriguez,Lake Worth,54.88,79.38,68.04,120.2,267.62,Single-ply,SBD,M
Boys,59.87,1,Dustin Gray,Lake Worth,58.74,174.63,77.11,208.65,460.4,Single-ply,SBD,M
Boys,59.87,2,Steven Rios,Carrollton Turner,58.51,127.01,90.72,133.81,351.53,Single-ply,SBD,M
Boys,67.13,1,Nate Barnd,Fort Worth Trimble Tech,67.13,204.12,115.67,185.97,505.76,Single-ply,SBD,M
Boys,67.13,2,Joel Bennett,Lake Worth,65.77,149.69,86.18,172.37,408.23,Single-ply,SBD,M
Boys,67.13,3,Alex Keeton,Dallas Highland Park,64.86,151.95,88.45,140.61,381.02,Single-ply,SBD,M
Boys,67.13,4,David Clark,Fort Worth Arlington Heights,61.46,142.88,81.65,149.69,374.21,Single-ply,SBD,M
Boys,67.13,5,Chris Jordan,Bishop Lynch,66.45,145.15,81.65,147.42,374.21,Single-ply,SBD,M
Boys,67.13,6,Brock Figart,Lake Dallas,67.13,133.81,83.91,142.88,360.61,Single-ply,SBD,M
Boys,74.84,1,Jacob Head,Bishop Lynch,68.72,215.46,117.93,192.78,526.17,Single-ply,SBD,M
Boys,74.84,2,Brandon Moore,Carrollton Turner,74.62,188.24,97.52,210.92,496.68,Single-ply,SBD,M
Boys,74.84,3,Jordan Funches,Carrollton Creekview,73.48,188.24,97.52,181.44,467.2,Single-ply,SBD,M
Boys,74.84,4,Marcus Wimby,Carrollton Ranchview,74.39,174.63,120.2,151.95,446.79,Single-ply,SBD,M
Boys,74.84,5,Jordan Green,Fort Worth Trimble Tech,74.84,172.37,88.45,183.7,444.52,Single-ply,SBD,M
Boys,82.1,6,Felipe Gallegos,Lake Worth,75.07,165.56,88.45,179.17,433.18,Single-ply,SBD,M
Boys,74.84,7,Chris Wimby,Carrollton Ranchview,71.44,158.76,102.06,170.1,430.91,Single-ply,SBD,M
Boys,74.84,8,Cole Swenke,Bishop Lynch,73.03,158.76,106.59,163.29,428.64,Single-ply,SBD,M
Boys,74.84,9,Michael Sadowski,Carrollton Turner,71.44,165.56,83.91,158.76,408.23,Single-ply,SBD,M
Boys,74.84,10,Zack Evans,Lake Worth,71.67,158.76,90.72,142.88,392.36,Single-ply,SBD,M
Boys,74.84,11,Nick Mouch,Dallas Highland Park,70.99,129.27,97.52,147.42,374.21,Single-ply,SBD,M
Boys,74.84,DQ,Austyn Pankratz,Carrollton Turner,74.16,,,,,Single-ply,SBD,M
Boys,82.1,1,Nick Krakosky,Bishop Lynch,81.19,226.8,120.2,215.46,562.45,Single-ply,SBD,M
Boys,82.1,2,Stacey Cooper,Carrollton Creekview,81.65,192.78,113.4,199.58,505.76,Single-ply,SBD,M
Boys,82.1,3,Diego Rosalas,Fort Worth Trimble Tech,78.24,181.44,108.86,183.7,474,Single-ply,SBD,M
Boys,82.1,4,Joe Howard,Fort Worth Arlington Heights,81.42,172.37,102.06,183.7,458.13,Single-ply,SBD,M
Boys,89.81,5,Devin Rhodes,Fort Worth Trimble Tech,82.33,195.04,104.33,158.76,458.13,Single-ply,SBD,M
Boys,82.1,6,Kevin Gutierrez,Bishop Lynch,81.65,188.24,74.84,183.7,446.79,Single-ply,SBD,M
Boys,82.1,7,Emmitt Gott,Carrollton Creekview,80.06,156.49,99.79,183.7,439.98,Single-ply,SBD,M
Boys,82.1,8,Minquan Robinson,Carrollton Creekview,77.11,158.76,86.18,190.51,435.45,Single-ply,SBD,M
Boys,82.1,9,Vicente Portillo,Carrollton Creekview,80.51,167.83,97.52,167.83,433.18,Single-ply,SBD,M
Boys,82.1,10,Sam Fenton,Fort Worth Arlington Heights,80.97,158.76,90.72,181.44,430.91,Single-ply,SBD,M
Boys,82.1,11,Keynon Smith,Fort Worth Arlington Heights,75.98,147.42,113.4,158.76,419.57,Single-ply,SBD,M
Boys,82.1,12,Luke Ross,Dallas Highland Park,79.38,161.03,104.33,149.69,415.04,Single-ply,SBD,M
Boys,82.1,13,Ian Hayashi,Dallas Highland Park,80.51,158.76,102.06,149.69,410.5,Single-ply,SBD,M
Boys,82.1,14,Michael Kim,Carrollton Ranchview,79.83,124.74,83.91,142.88,351.53,Single-ply,SBD,M
Boys,82.1,15,Gage Shorter,Dallas Highland Park,81.19,122.47,77.11,149.69,349.27,Single-ply,SBD,M
Boys,82.1,16,Grayson Schantz,Lake Dallas,82.1,131.54,81.65,136.08,349.27,Single-ply,SBD,M
Boys,82.1,17,Alex Reyes,Carrollton Ranchview,75.3,124.74,77.11,142.88,344.73,Single-ply,SBD,M
Boys,82.1,18,Jordan Akiyoshi,Dallas Highland Park,76.88,72.57,63.5,131.54,267.62,Single-ply,SBD,M
Boys,82.1,DQ,Magrullio Salsado,Fort Worth Trimble Tech,81.87,195.04,,,,Single-ply,SBD,M
Boys,89.81,1,Chase Gaddy,Bishop Lynch,85.73,272.16,170.1,226.8,669.05,Single-ply,SBD,M
Boys,89.81,2,Spencer Heflin,Lake Worth,89.36,201.85,122.47,215.46,539.77,Single-ply,SBD,M
Boys,89.81,3,Josh Wisely,Carrollton Ranchview,87.32,226.8,124.74,185.97,537.51,Single-ply,SBD,M
Boys,89.81,4,Reid Oden,Dallas Highland Park,87.54,165.56,129.27,181.44,476.27,Single-ply,SBD,M
Boys,89.81,5,Fredis De La Rosa,Carrollton Turner,89.36,174.63,117.93,181.44,474,Single-ply,SBD,M
Boys,89.81,6,Jeong Seo,Carrollton Creekview,89.58,158.76,106.59,188.24,453.59,Single-ply,SBD,M
Boys,89.81,7,Williams Adrian,Carrollton Creekview,87.77,158.76,102.06,158.76,419.57,Single-ply,SBD,M
Boys,89.81,8,Seth Gamez,Fort Worth Trimble Tech,88.45,192.78,86.18,140.61,419.57,Single-ply,SBD,M
Boys,89.81,9,Ben Howe,Lake Dallas,89.81,151.95,90.72,136.08,378.75,Single-ply,SBD,M
Boys,89.81,DQ,Cody Mason,Carrollton Turner,89.13,,,,,Single-ply,SBD,M
Boys,89.81,DQ,Dwight McBrayer,Carrollton Ranchview,87.54,142.88,,,,Single-ply,SBD,M
Boys,99.79,1,Matt Bebb,Bishop Lynch,90.26,199.58,142.88,226.8,569.26,Single-ply,SBD,M
Boys,99.79,2,Terry Owens,Fort Worth Trimble Tech,99.11,208.65,145.15,208.65,562.45,Single-ply,SBD,M
Boys,99.79,3,Chris Dimas,Lake Worth,99.34,185.97,120.2,199.58,505.76,Single-ply,SBD,M
Boys,99.79,4,Marcus Trevino,Carrollton Creekview,95.25,215.46,104.33,181.44,501.22,Single-ply,SBD,M
Boys,99.79,5,Mark Dowdall,Dallas Highland Park,92.53,185.97,124.74,188.24,498.95,Single-ply,SBD,M
Boys,99.79,6,David Montenegro,Carrollton Turner,93.21,204.12,111.13,183.7,498.95,Single-ply,SBD,M
Boys,99.79,7,Peyton Loftis,Dallas Highland Park,91.63,172.37,138.35,170.1,480.81,Single-ply,SBD,M
Boys,99.79,8,Lee Vinton,Lake Dallas,92.08,190.51,117.93,170.1,478.54,Single-ply,SBD,M
Boys,99.79,9,Blake Shorter,Dallas Highland Park,97.98,170.1,115.67,181.44,467.2,Single-ply,SBD,M
Boys,99.79,10,Wesley Spence,Lake Worth,94.12,195.04,97.52,170.1,462.66,Single-ply,SBD,M
Boys,99.79,11,Alex Franks,Dallas Highland Park,99.34,163.29,115.67,181.44,460.4,Single-ply,SBD,M
Boys,99.79,12,Tony Perez,Dallas Highland Park,93.67,161.03,115.67,158.76,435.45,Single-ply,SBD,M
Boys,99.79,13,Luis Carreno,Carrollton Ranchview,99.56,138.35,72.57,142.88,353.8,Single-ply,SBD,M
Boys,99.79,14,Nick Salinaro,Dallas Highland Park,99.34,117.93,77.11,136.08,331.12,Single-ply,SBD,M
Boys,99.79,15,William Barns,Dallas Highland Park,92.53,111.13,63.5,131.54,306.17,Single-ply,SBD,M
Boys,109.77,1,Trevor Gardner,Lake Worth,107.5,231.33,140.61,199.58,571.53,Single-ply,SBD,M
Boys,109.77,2,Mauricio Garza,Dallas Highland Park,103.87,188.24,154.22,185.97,528.44,Single-ply,SBD,M
Boys,109.77,3,Earnest Thomas,Fort Worth Arlington Heights,101.6,192.78,117.93,206.38,517.1,Single-ply,SBD,M
Boys,109.77,4,Jordan Brazzell,Lake Dallas,109.77,195.04,136.08,185.97,517.1,Single-ply,SBD,M
Boys,109.77,5,Richard Johnson,Carrollton Ranchview,105.69,188.24,108.86,197.31,494.42,Single-ply,SBD,M
Boys,109.77,6,Coleman Glass,Dallas Highland Park,102.06,176.9,142.88,170.1,489.88,Single-ply,SBD,M
Boys,109.77,7,Othon Perales,Fort Worth Arlington Heights,104.78,204.12,102.06,183.7,489.88,Single-ply,SBD,M
Boys,109.77,8,John Sackville,Carrollton Creekview,105.46,181.44,106.59,156.49,444.52,Single-ply,SBD,M
Boys,109.77,9,William Rury,Dallas Highland Park,109.77,163.29,106.59,158.76,428.64,Single-ply,SBD,M
Boys,109.77,10,Javier Padilla,Fort Worth Trimble Tech,104.78,145.15,106.59,165.56,417.3,Single-ply,SBD,M
Boys,109.77,11,Sebastian Sara,Carrollton Ranchview,107.5,102.06,120.2,183.7,405.97,Single-ply,SBD,M
Boys,109.77,12,Tanner Hutt,Dallas Highland Park,109.77,136.08,104.33,149.69,390.09,Single-ply,SBD,M
Boys,109.77,13,David Fridae,Carrollton Turner,108.41,92.99,61.23,117.93,272.16,Single-ply,SBD,M
Boys,124.74,1,Daniel Cooley,Lake Dallas,124.74,283.5,229.06,260.82,773.37,Single-ply,SBD,M
Boys,124.74,2,Jonathan Dimas,Lake Worth,121.11,267.62,151.95,249.48,669.05,Single-ply,SBD,M
Boys,124.74,3,Jeremiah Justice,Carrollton Ranchview,119.52,249.48,124.74,174.63,548.85,Single-ply,SBD,M
Boys,124.74,4,Patrick Alonzo,Lake Dallas,124.74,192.78,154.22,199.58,546.58,Single-ply,SBD,M
Boys,124.74,5,Clairborne Myers,Dallas Highland Park,119.52,192.78,115.67,181.44,489.88,Single-ply,SBD,M
Boys,124.74+,6,Steve Rivera,Fort Worth Trimble Tech,124.96,181.44,104.33,204.12,489.88,Single-ply,SBD,M
Boys,124.74,7,Mike Harris,Fort Worth Trimble Tech,121.11,165.56,113.4,192.78,471.74,Single-ply,SBD,M
Boys,124.74,8,Chongo Kondolo,Carrollton Creekview,123.38,147.42,131.54,147.42,426.38,Single-ply,SBD,M
Boys,124.74,9,Bennett Campbell,Dallas Highland Park,113.85,111.13,63.5,131.54,306.17,Single-ply,SBD,M
Boys,124.74+,1,Jason Litt,Lake Dallas,125.19,272.16,192.78,204.12,669.05,Single-ply,SBD,M
Boys,124.74+,2,Enrique Rodriguez,Carrollton Turner,135.4,265.35,131.54,208.65,605.55,Single-ply,SBD,M
Boys,124.74+,3,Jordan Jackson,Fort Worth Trimble Tech,128.82,226.8,138.35,204.12,569.26,Single-ply,SBD,M
Boys,124.74+,4,Yanko Kovachev,Carrollton Creekview,135.85,226.8,115.67,195.04,537.51,Single-ply,SBD,M
Boys,124.74+,5,Wesley Molina,Lake Worth,143.11,204.12,142.88,190.51,537.51,Single-ply,SBD,M
Boys,124.74+,6,Kennith King,Fort Worth Trimble Tech,158.76,235.87,113.4,174.63,523.9,Single-ply,SBD,M
Boys,124.74+,7,Kyle Stouffer,Dallas Highland Park,132.22,179.17,111.13,197.31,487.61,Single-ply,SBD,M
Boys,124.74+,8,John Laubacher,Lake Dallas,125.19,158.76,113.4,142.88,415.04,Single-ply,SBD,M
Boys,124.74+,9,Zach Luger,Carrollton Ranchview,131.54,136.08,70.31,142.88,349.27,Single-ply,SBD,M
Boys,124.74+,DQ,Nick Triger,Bishop Lynch,134.94,192.78,111.13,,,Single-ply,SBD,M
