Division,WeightClassKg,Place,Name,Team,BodyweightKg,Best3SquatKg,Best3BenchKg,Best3DeadliftKg,TotalKg,Equipment,Event,Sex
Boys,51.71,1,Jacob Noyolla,Little River Academy,48.99,92.99,54.43,120.2,267.62,Single-ply,SBD,M
Boys,51.71,2,Justin Sultenfuss,Little River Academy,51.44,97.52,56.7,113.4,267.62,Single-ply,SBD,M
Boys,55.79,1,Shawn Pittman,Thrall,53.89,131.54,58.97,136.08,326.59,Single-ply,SBD,M
Boys,55.79,2,Logan McMillan,Little River Academy,55.34,113.4,70.31,115.67,299.37,Single-ply,SBD,M
Boys,55.79,3,Gavin Smith,Little River Academy,55.52,90.72,54.43,104.33,249.48,Single-ply,SBD,M
Boys,55.79,4,Cody Pittman,Thrall,53.8,74.84,56.7,77.11,208.65,Single-ply,SBD,M
Boys,67.13,1,Darryl Florez,Cameron Yoe,66.68,142.88,92.99,176.9,412.77,Single-ply,SBD,M
Boys,67.13,2,Danny Rogalie,Little River Academy,66.13,158.76,72.57,151.95,383.29,Single-ply,SBD,M
Boys,67.13,3,Jake LaMotte,Little River Academy,61.51,136.08,81.65,142.88,360.61,Single-ply,SBD,M
Boys,74.84,4,Andrew Ramstedt,Little River Academy,67.31,131.54,72.57,122.47,326.59,Single-ply,SBD,M
Boys,67.13,5,Iain McVeigh,Little River Academy,66.04,104.33,61.23,115.67,281.23,Single-ply,SBD,M
Boys,74.84,1,Alex Kyner,Thrall,72.3,204.12,136.08,217.72,557.92,Single-ply,SBD,M
Boys,74.84,2,Bryce Williams,Little River Academy,71.94,201.85,97.52,201.85,501.22,Single-ply,SBD,M
Boys,82.1,3,Alec Behrendt,Thrall,74.93,176.9,120.2,176.9,474,Single-ply,SBD,M
Boys,74.84,4,Zack Smith,Little River Academy,71.4,158.76,102.06,183.7,444.52,Single-ply,SBD,M
Boys,74.84,5,Eduardo Bautista,Cameron Yoe,73.94,145.15,111.13,167.83,424.11,Single-ply,SBD,M
Boys,74.84,6,Grayson Edwards,Little River Academy,73.39,147.42,83.91,151.95,383.29,Single-ply,SBD,M
Boys,74.84,7,Tyler Stairs,Salado,72.3,136.08,74.84,127.01,337.93,Single-ply,SBD,M
Boys,74.84,8,Cooper Womack,Salado,70.76,124.74,61.23,131.54,317.51,Single-ply,SBD,M
Boys,74.84,9,Esidro Garza,Thrall,69.67,106.59,81.65,120.2,308.44,Single-ply,SBD,M
Boys,74.84,10,Titus Lewis,Cameron Yoe,71.4,102.06,74.84,102.06,278.96,Single-ply,SBD,M
Boys,82.1,1,Ricky Sampson,Salado,79.29,163.29,97.52,174.63,435.45,Single-ply,SBD,M
Boys,82.1,2,Allen Sirois,Salado,78.74,108.86,79.38,138.35,326.59,Single-ply,SBD,M
Boys,89.81,1,Noah Gonzales,Cameron Yoe,89.63,122.47,99.79,149.69,371.95,Single-ply,SBD,M
Boys,89.81,2,Andrew Remmenga,Thrall,89.81,142.88,77.11,145.15,365.14,Single-ply,SBD,M
Boys,89.81,DQ,Nick Lowrance,Salado,86.64,117.93,,145.15,,Single-ply,SBD,M
Boys,99.79,1,Lance Spakes,Salado,93.17,154.22,102.06,138.35,394.63,Single-ply,SBD,M
Boys,99.79,2,Dante Maxwell,Thrall,99.79,147.42,106.59,138.35,392.36,Single-ply,SBD,M
Boys,109.77,1,Collin McMillan,Little River Academy,108.32,244.94,172.37,267.62,684.92,Single-ply,SBD,M
Boys,124.74,2,Tomas Salomon,Cameron Yoe,109.86,163.29,102.06,188.24,453.59,Single-ply,SBD,M
Boys,109.77,3,Matthew Sumbillo,Thrall,100.88,165.56,108.86,167.83,442.25,Single-ply,SBD,M
Boys,109.77,4,Pablo Rodriguez,Cameron Yoe,102.24,149.69,90.72,165.56,405.97,Single-ply,SBD,M
Boys,109.77,5,Brian McDonald,Cameron Yoe,109.32,92.99,63.5,102.06,258.55,Single-ply,SBD,M
Boys,109.77,DQ,Ryan Bradley,Salado,101.51,161.03,,,,Single-ply,SBD,M
Boys,124.74,1,Peyton Womack,Salado,118.3,285.76,142.88,235.87,664.51,Single-ply,SBD,M
Boys,124.74,2,Jakob Popple,Salado,116.03,199.58,106.59,192.78,498.95,Single-ply,SBD,M
Boys,124.74+,1,Grayson Eaton,Little River Academy,157.58,278.96,165.56,206.38,650.91,Single-ply,SBD,M
Boys,124.74+,2,Jake Pirtle,Little River Academy,125.55,197.31,111.13,181.44,489.88,Single-ply,SBD,M
