Place,Sex,Name,CyrillicName,BodyweightKg,Squat1Kg,Squat2Kg,Squat3Kg,Best3SquatKg,Squat4Kg,Bench1Kg,Bench2Kg,Bench3Kg,Best3BenchKg,Bench4Kg,Deadlift1Kg,Deadlift2Kg,Deadlift3Kg,Best3DeadliftKg,Deadlift4Kg,TotalKg,WeightClassKg,Event,Equipment,Tested,Division,Age,BirthDate
1,F,Darya Khorkova,Дарья Хорькова,51.7,70,75,-80,75,,47.5,-50,-50,47.5,,90,-100,100,100,,222.5,52,SBD,Wraps,Yes,Amateur Juniors,22,1996-03-01
1,M,Artem Epishin,Артем Епишин,108.4,190,205,-215,205,,160,175,,175,,200,230,-240,230,,610,110,SBD,Wraps,Yes,Amateur Open,36,1982-04-16
1,M,Ruslan Maksimov,Руслан Максимов,80.8,120,-130,-135,120,,-75,80,85,85,,-130,-140,145,145,,350,82.5,SBD,Wraps,No,Pro Teen 14-16,17,2001-03-16
1,M,Yuriy Chervanev,Юрий Черванев,101.1,140,155,165,165,,-135,-135,135,135,,160,175,185,185,,485,110,SBD,Wraps,No,Pro Open,33,1985-04-14
DQ,M,Ilya Udalov,Илья Удалов,109.9,220,232.5,-245,232.5,,-155,-160,-160,,,,,,,,,110,SBD,Wraps,No,Pro Open,22,1996-07-22
1,M,Viktor Fadeev,Виктор Фадеев,111.7,170,-180,,170,,-100,105,110,110,,180,200,-210,200,,480,125,SBD,Wraps,No,Pro Open,28,1990-05-08
1,M,Mirzobobur Nasriddinov,Мирзобобур Насриддинов,82.4,190,205,210,210,,140,150,155,155,,215,235,-240,235,,600,82.5,SBD,Wraps,No,Pro Open,29,1989-06-26
1,F,Darya Khorkova,Дарья Хорькова,51.7,,,,,,50,,,50,,,,,,,50,52,B,Raw,Yes,Amateur Juniors,22,1996-03-01
1,M,Pavel Rodin,Павел Родин,55.5,,,,,,60,62.5,67.5,67.5,,,,,,,67.5,56,B,Raw,Yes,Amateur Teen 14-16,16,2002-08-26
1,M,Dato Khalizov,Дато Хализов,58.8,,,,,,97.5,-112.5,112.5,112.5,,,,,,,112.5,60,B,Raw,Yes,Amateur Open,35,1983-05-02
1,M,Roman Pushkin,Роман Пушкин,66.4,,,,,,-85,85,90,90,,,,,,,90,67.5,B,Raw,Yes,Amateur Teen 17-19,19,1998-11-12
1,M,Andrey Kuprikov,Андрей Куприков,66.6,,,,,,117.5,122.5,127.5,127.5,,,,,,,127.5,67.5,B,Raw,Yes,Amateur Open,31,1987-02-17
2,M,Anton Kobzev,Антон Кобзев,64.4,,,,,,115,120,-125,120,,,,,,,120,67.5,B,Raw,Yes,Amateur Open,28,1989-11-18
1,M,Aleksey Fomin,Алексей Фомин,78,,,,,,127.5,130,-135,130,,,,,,,130,82.5,B,Raw,Yes,Amateur Juniors,22,1995-11-29
1,M,Vladimir Kurbasov,Владимир Курбасов,86.9,,,,,,115,-120,120,120,,,,,,,120,90,B,Raw,Yes,Amateur Masters 50-59,59,1959-06-06
1,M,Vladimir Nasedkin,Владимир Наседкин,114.9,,,,,,170,177.5,182.5,182.5,,,,,,,182.5,125,B,Raw,Yes,Amateur Open,33,1985-07-02
1,M,Ruslan Skiba,Руслан Скиба,66.2,,,,,,75,-80,-85,75,,,,,,,75,67.5,B,Raw,No,Pro Teen 14-16,15,2003-06-24
1,M,Dmitriy Skvortsov,Дмитрий Скворцов,74.2,,,,,,135,142.5,-147.5,142.5,,,,,,,142.5,75,B,Raw,No,Pro Open,30,1988-07-05
2,M,Stanislav Vorobyov,Станислав Воробьёв,73.6,,,,,,120,127.5,-135,127.5,,,,,,,127.5,75,B,Raw,No,Pro Open,24,1994-04-28
1,M,Andrey Ageev,Андрей Агеев,81.9,,,,,,137.5,142.5,,142.5,,,,,,,142.5,82.5,B,Raw,No,Pro Juniors,23,1995-05-23
1,M,Klimentiy Voevodin,Климентий Воеводин,86.1,,,,,,-125,125,135,135,,,,,,,135,90,B,Raw,No,Pro Juniors,21,1997-09-07
1,M,Aleksey Nikolaenko,Алексей Николаенко,90,,,,,,200,-205,-205,200,,,,,,,200,90,B,Raw,No,Pro Open,29,1989-02-07
2,M,Evgeniy Shtyrkov,Евгений Штырков,88.1,,,,,,160,170,175,175,,,,,,,175,90,B,Raw,No,Pro Open,30,1987-12-14
1,M,Dmitriy Popko,Дмитрий Попко,100,,,,,,207.5,212.5,217.5,217.5,,,,,,,217.5,100,B,Raw,No,Pro Open,30,1988-07-17
2,M,Dmitriy Filin,Дмитрий Филин,98.7,,,,,,180,185,190,190,,,,,,,190,100,B,Raw,No,Pro Open,28,1990-01-23
1,M,Aleksandr Popkov,Александр Попков,94.6,,,,,,110,115,120,120,,,,,,,120,100,B,Raw,No,Pro Masters 40-49,45,1973-05-13
1,M,Vasiliy Stenin,Василий Стенин,104,,,,,,160,167.5,-170,167.5,,,,,,,167.5,110,B,Raw,No,Pro Masters 40-49,43,1975-06-05
1,M,Ivan Anisimov,Иван Анисимов,123.3,,,,,,95,105,110,110,,,,,,,110,125,B,Raw,No,Pro Teen 14-16,17,2001-05-16
1,M,Ivan Avramenko,Иван Авраменко,112.5,,,,,,175,185,-192.5,185,,,,,,,185,125,B,Raw,No,Pro Open,30,1988-03-24
1,M,Ilya Fomin,Илья Фомин,137.8,,,,,,175,185,195,195,,,,,,,195,140,B,Raw,No,Pro Open,24,1994-08-04
1,M,Sergey Chernyshov,Сергей Чернышов,95.7,,,,,,170,180,-192.5,180,,,,,,,180,100,B,Single-ply,No,Pro Open,27,1991-07-06
1,F,Elena Doroshina,Елена Дорошина,55.4,,,,,,-75,75,-80,75,,,,,,,75,56,B,Multi-ply,No,Pro Open,43,1975-06-01
1,M,Aleksey Samardin,Алексей Самардин,72,,,,,,187.5,200,-212.5,200,,,,,,,200,75,B,Multi-ply,No,Pro Open,35,1983-09-08
1,M,Sergey Muratov,Сергей Муратов,105.75,,,,,,-220,220,-240,220,,,,,,,220,110,B,Multi-ply,No,Pro Open,36,1982-08-09
1,M,Oleg Shlepin,Олег Шлепин,113.2,,,,,,-250,-260,270,270,,,,,,,270,125,B,Multi-ply,No,Pro Open,43,1975-07-08
1,M,Mariya Tarasova,Мария Тарасова,46.25,,,,,,,,,,,70,-77.5,80,80,,80,48,D,Raw,Yes,Amateur Open,20,1997-12-03
1,M,Vladimir Kurbasov,Владимир Курбасов,86.9,,,,,,,,,,,-170,180,190,190,,190,90,D,Raw,Yes,Amateur Masters 50-59,59,1959-06-06
1,M,Oksana Khromova,Оксана Хромова,52.4,,,,,,,,,,,100,-120,-120,100,,100,56,D,Raw,No,Pro Open,47,1971-10-13
1,M,Andrey Ageev,Андрей Агеев,81.9,,,,,,,,,,,215,227.5,,227.5,,227.5,82.5,D,Raw,No,Pro Juniors,23,1995-05-23
1,M,Mirzobobur Nasriddinov,Мирзобобур Насриддинов,82.4,,,,,,,,,,,215,235,-240,235,,235,82.5,D,Raw,No,Pro Open,29,1989-06-26
1,M,Sergey Chernyshov,Сергей Чернышов,95.7,,,,,,,,,,,220,-240,-240,220,,220,100,D,Raw,No,Pro Open,27,1991-07-06
