<?xml version="1.0" encoding="UTF-8"?>
<session version="1.0">
<refactoring accessors="true" comment="Delete element from project &apos;spectre-system-api&apos;&#x0A;- Original project: &apos;spectre-system-api&apos;&#x0A;- Original element: &apos;error-handling.xml&apos;" description="Delete element" element1="src/main/mule/error-handling.xml" elements="0" flags="589830" id="org.eclipse.jdt.ui.delete" resources="1" stamp="1548987541293" subPackages="false" version="1.0"/>
</session>