M48
; DRILL file {KiCad (5.1.5)-3} date Thu 10 Sep 8:40:14 PM
; FORMAT={-:-/ absolute / metric / decimal}
; #@! TF.CreationDate,2020-09-10T20:40:14-07:00
; #@! TF.GenerationSoftware,Kicad,Pcbnew,(5.1.5)-3
; #@! TF.FileFunction,Plated,1,2,PTH
FMAT,2
METRIC
T1C0.250
T2C0.300
T3C1.000
%
G90
G05
T1
X147.066Y-106.68
X150.114Y-108.458
X155.956Y-107.95
X155.956Y-110.998
T2
X145.796Y-106.68
T3
X137.922Y-110.236
X140.462Y-110.236
X143.002Y-110.236
X145.542Y-110.236
X139.192Y-89.167
X139.192Y-91.167
X139.192Y-93.167
X139.192Y-95.167
X145.692Y-89.167
X145.692Y-91.167
X145.692Y-93.167
X145.692Y-95.167
X152.192Y-89.167
X152.192Y-91.167
X152.192Y-93.167
X152.192Y-95.167
X158.692Y-89.167
X158.692Y-91.167
X158.692Y-93.167
X158.692Y-95.167
T0
M30
