G04 #@! TF.GenerationSoftware,KiCad,Pcbnew,(5.1.5)-3*
G04 #@! TF.CreationDate,2020-09-10T20:38:22-07:00*
G04 #@! TF.ProjectId,ADCS_Daughterboard,41444353-5f44-4617-9567-68746572626f,rev?*
G04 #@! TF.SameCoordinates,Original*
G04 #@! TF.FileFunction,Soldermask,Bot*
G04 #@! TF.FilePolarity,Negative*
%FSLAX46Y46*%
G04 Gerber Fmt 4.6, Leading zero omitted, Abs format (unit mm)*
G04 Created by KiCad (PCBNEW (5.1.5)-3) date 2020-09-10 20:38:22*
%MOMM*%
%LPD*%
G04 APERTURE LIST*
%ADD10C,0.100000*%
G04 APERTURE END LIST*
D10*
G36*
X146443000Y-111137000D02*
G01*
X144641000Y-111137000D01*
X144641000Y-109335000D01*
X146443000Y-109335000D01*
X146443000Y-111137000D01*
G37*
G36*
X140575512Y-109339927D02*
G01*
X140724812Y-109369624D01*
X140888784Y-109437544D01*
X141036354Y-109536147D01*
X141161853Y-109661646D01*
X141260456Y-109809216D01*
X141328376Y-109973188D01*
X141363000Y-110147259D01*
X141363000Y-110324741D01*
X141328376Y-110498812D01*
X141260456Y-110662784D01*
X141161853Y-110810354D01*
X141036354Y-110935853D01*
X140888784Y-111034456D01*
X140724812Y-111102376D01*
X140575512Y-111132073D01*
X140550742Y-111137000D01*
X140373258Y-111137000D01*
X140348488Y-111132073D01*
X140199188Y-111102376D01*
X140035216Y-111034456D01*
X139887646Y-110935853D01*
X139762147Y-110810354D01*
X139663544Y-110662784D01*
X139595624Y-110498812D01*
X139561000Y-110324741D01*
X139561000Y-110147259D01*
X139595624Y-109973188D01*
X139663544Y-109809216D01*
X139762147Y-109661646D01*
X139887646Y-109536147D01*
X140035216Y-109437544D01*
X140199188Y-109369624D01*
X140348488Y-109339927D01*
X140373258Y-109335000D01*
X140550742Y-109335000D01*
X140575512Y-109339927D01*
G37*
G36*
X138035512Y-109339927D02*
G01*
X138184812Y-109369624D01*
X138348784Y-109437544D01*
X138496354Y-109536147D01*
X138621853Y-109661646D01*
X138720456Y-109809216D01*
X138788376Y-109973188D01*
X138823000Y-110147259D01*
X138823000Y-110324741D01*
X138788376Y-110498812D01*
X138720456Y-110662784D01*
X138621853Y-110810354D01*
X138496354Y-110935853D01*
X138348784Y-111034456D01*
X138184812Y-111102376D01*
X138035512Y-111132073D01*
X138010742Y-111137000D01*
X137833258Y-111137000D01*
X137808488Y-111132073D01*
X137659188Y-111102376D01*
X137495216Y-111034456D01*
X137347646Y-110935853D01*
X137222147Y-110810354D01*
X137123544Y-110662784D01*
X137055624Y-110498812D01*
X137021000Y-110324741D01*
X137021000Y-110147259D01*
X137055624Y-109973188D01*
X137123544Y-109809216D01*
X137222147Y-109661646D01*
X137347646Y-109536147D01*
X137495216Y-109437544D01*
X137659188Y-109369624D01*
X137808488Y-109339927D01*
X137833258Y-109335000D01*
X138010742Y-109335000D01*
X138035512Y-109339927D01*
G37*
G36*
X143115512Y-109339927D02*
G01*
X143264812Y-109369624D01*
X143428784Y-109437544D01*
X143576354Y-109536147D01*
X143701853Y-109661646D01*
X143800456Y-109809216D01*
X143868376Y-109973188D01*
X143903000Y-110147259D01*
X143903000Y-110324741D01*
X143868376Y-110498812D01*
X143800456Y-110662784D01*
X143701853Y-110810354D01*
X143576354Y-110935853D01*
X143428784Y-111034456D01*
X143264812Y-111102376D01*
X143115512Y-111132073D01*
X143090742Y-111137000D01*
X142913258Y-111137000D01*
X142888488Y-111132073D01*
X142739188Y-111102376D01*
X142575216Y-111034456D01*
X142427646Y-110935853D01*
X142302147Y-110810354D01*
X142203544Y-110662784D01*
X142135624Y-110498812D01*
X142101000Y-110324741D01*
X142101000Y-110147259D01*
X142135624Y-109973188D01*
X142203544Y-109809216D01*
X142302147Y-109661646D01*
X142427646Y-109536147D01*
X142575216Y-109437544D01*
X142739188Y-109369624D01*
X142888488Y-109339927D01*
X142913258Y-109335000D01*
X143090742Y-109335000D01*
X143115512Y-109339927D01*
G37*
G36*
X159052585Y-103380802D02*
G01*
X159202410Y-103410604D01*
X159484674Y-103527521D01*
X159738705Y-103697259D01*
X159954741Y-103913295D01*
X160124479Y-104167326D01*
X160241396Y-104449590D01*
X160301000Y-104749240D01*
X160301000Y-105054760D01*
X160241396Y-105354410D01*
X160124479Y-105636674D01*
X159954741Y-105890705D01*
X159738705Y-106106741D01*
X159484674Y-106276479D01*
X159202410Y-106393396D01*
X159052585Y-106423198D01*
X158902761Y-106453000D01*
X158597239Y-106453000D01*
X158447415Y-106423198D01*
X158297590Y-106393396D01*
X158015326Y-106276479D01*
X157761295Y-106106741D01*
X157545259Y-105890705D01*
X157375521Y-105636674D01*
X157258604Y-105354410D01*
X157199000Y-105054760D01*
X157199000Y-104749240D01*
X157258604Y-104449590D01*
X157375521Y-104167326D01*
X157545259Y-103913295D01*
X157761295Y-103697259D01*
X158015326Y-103527521D01*
X158297590Y-103410604D01*
X158447415Y-103380802D01*
X158597239Y-103351000D01*
X158902761Y-103351000D01*
X159052585Y-103380802D01*
G37*
G36*
X152429142Y-94384942D02*
G01*
X152577101Y-94446229D01*
X152710255Y-94535199D01*
X152823501Y-94648445D01*
X152912471Y-94781599D01*
X152973758Y-94929558D01*
X153005000Y-95086625D01*
X153005000Y-95246775D01*
X152973758Y-95403842D01*
X152912471Y-95551801D01*
X152823501Y-95684955D01*
X152710255Y-95798201D01*
X152577101Y-95887171D01*
X152429142Y-95948458D01*
X152272075Y-95979700D01*
X152111925Y-95979700D01*
X151954858Y-95948458D01*
X151806899Y-95887171D01*
X151673745Y-95798201D01*
X151560499Y-95684955D01*
X151471529Y-95551801D01*
X151410242Y-95403842D01*
X151379000Y-95246775D01*
X151379000Y-95086625D01*
X151410242Y-94929558D01*
X151471529Y-94781599D01*
X151560499Y-94648445D01*
X151673745Y-94535199D01*
X151806899Y-94446229D01*
X151954858Y-94384942D01*
X152111925Y-94353700D01*
X152272075Y-94353700D01*
X152429142Y-94384942D01*
G37*
G36*
X145929142Y-94384942D02*
G01*
X146077101Y-94446229D01*
X146210255Y-94535199D01*
X146323501Y-94648445D01*
X146412471Y-94781599D01*
X146473758Y-94929558D01*
X146505000Y-95086625D01*
X146505000Y-95246775D01*
X146473758Y-95403842D01*
X146412471Y-95551801D01*
X146323501Y-95684955D01*
X146210255Y-95798201D01*
X146077101Y-95887171D01*
X145929142Y-95948458D01*
X145772075Y-95979700D01*
X145611925Y-95979700D01*
X145454858Y-95948458D01*
X145306899Y-95887171D01*
X145173745Y-95798201D01*
X145060499Y-95684955D01*
X144971529Y-95551801D01*
X144910242Y-95403842D01*
X144879000Y-95246775D01*
X144879000Y-95086625D01*
X144910242Y-94929558D01*
X144971529Y-94781599D01*
X145060499Y-94648445D01*
X145173745Y-94535199D01*
X145306899Y-94446229D01*
X145454858Y-94384942D01*
X145611925Y-94353700D01*
X145772075Y-94353700D01*
X145929142Y-94384942D01*
G37*
G36*
X139429142Y-94384942D02*
G01*
X139577101Y-94446229D01*
X139710255Y-94535199D01*
X139823501Y-94648445D01*
X139912471Y-94781599D01*
X139973758Y-94929558D01*
X140005000Y-95086625D01*
X140005000Y-95246775D01*
X139973758Y-95403842D01*
X139912471Y-95551801D01*
X139823501Y-95684955D01*
X139710255Y-95798201D01*
X139577101Y-95887171D01*
X139429142Y-95948458D01*
X139272075Y-95979700D01*
X139111925Y-95979700D01*
X138954858Y-95948458D01*
X138806899Y-95887171D01*
X138673745Y-95798201D01*
X138560499Y-95684955D01*
X138471529Y-95551801D01*
X138410242Y-95403842D01*
X138379000Y-95246775D01*
X138379000Y-95086625D01*
X138410242Y-94929558D01*
X138471529Y-94781599D01*
X138560499Y-94648445D01*
X138673745Y-94535199D01*
X138806899Y-94446229D01*
X138954858Y-94384942D01*
X139111925Y-94353700D01*
X139272075Y-94353700D01*
X139429142Y-94384942D01*
G37*
G36*
X158929142Y-94384942D02*
G01*
X159077101Y-94446229D01*
X159210255Y-94535199D01*
X159323501Y-94648445D01*
X159412471Y-94781599D01*
X159473758Y-94929558D01*
X159505000Y-95086625D01*
X159505000Y-95246775D01*
X159473758Y-95403842D01*
X159412471Y-95551801D01*
X159323501Y-95684955D01*
X159210255Y-95798201D01*
X159077101Y-95887171D01*
X158929142Y-95948458D01*
X158772075Y-95979700D01*
X158611925Y-95979700D01*
X158454858Y-95948458D01*
X158306899Y-95887171D01*
X158173745Y-95798201D01*
X158060499Y-95684955D01*
X157971529Y-95551801D01*
X157910242Y-95403842D01*
X157879000Y-95246775D01*
X157879000Y-95086625D01*
X157910242Y-94929558D01*
X157971529Y-94781599D01*
X158060499Y-94648445D01*
X158173745Y-94535199D01*
X158306899Y-94446229D01*
X158454858Y-94384942D01*
X158611925Y-94353700D01*
X158772075Y-94353700D01*
X158929142Y-94384942D01*
G37*
G36*
X152429142Y-92384942D02*
G01*
X152577101Y-92446229D01*
X152710255Y-92535199D01*
X152823501Y-92648445D01*
X152912471Y-92781599D01*
X152973758Y-92929558D01*
X153005000Y-93086625D01*
X153005000Y-93246775D01*
X152973758Y-93403842D01*
X152912471Y-93551801D01*
X152823501Y-93684955D01*
X152710255Y-93798201D01*
X152577101Y-93887171D01*
X152429142Y-93948458D01*
X152272075Y-93979700D01*
X152111925Y-93979700D01*
X151954858Y-93948458D01*
X151806899Y-93887171D01*
X151673745Y-93798201D01*
X151560499Y-93684955D01*
X151471529Y-93551801D01*
X151410242Y-93403842D01*
X151379000Y-93246775D01*
X151379000Y-93086625D01*
X151410242Y-92929558D01*
X151471529Y-92781599D01*
X151560499Y-92648445D01*
X151673745Y-92535199D01*
X151806899Y-92446229D01*
X151954858Y-92384942D01*
X152111925Y-92353700D01*
X152272075Y-92353700D01*
X152429142Y-92384942D01*
G37*
G36*
X145929142Y-92384942D02*
G01*
X146077101Y-92446229D01*
X146210255Y-92535199D01*
X146323501Y-92648445D01*
X146412471Y-92781599D01*
X146473758Y-92929558D01*
X146505000Y-93086625D01*
X146505000Y-93246775D01*
X146473758Y-93403842D01*
X146412471Y-93551801D01*
X146323501Y-93684955D01*
X146210255Y-93798201D01*
X146077101Y-93887171D01*
X145929142Y-93948458D01*
X145772075Y-93979700D01*
X145611925Y-93979700D01*
X145454858Y-93948458D01*
X145306899Y-93887171D01*
X145173745Y-93798201D01*
X145060499Y-93684955D01*
X144971529Y-93551801D01*
X144910242Y-93403842D01*
X144879000Y-93246775D01*
X144879000Y-93086625D01*
X144910242Y-92929558D01*
X144971529Y-92781599D01*
X145060499Y-92648445D01*
X145173745Y-92535199D01*
X145306899Y-92446229D01*
X145454858Y-92384942D01*
X145611925Y-92353700D01*
X145772075Y-92353700D01*
X145929142Y-92384942D01*
G37*
G36*
X158929142Y-92384942D02*
G01*
X159077101Y-92446229D01*
X159210255Y-92535199D01*
X159323501Y-92648445D01*
X159412471Y-92781599D01*
X159473758Y-92929558D01*
X159505000Y-93086625D01*
X159505000Y-93246775D01*
X159473758Y-93403842D01*
X159412471Y-93551801D01*
X159323501Y-93684955D01*
X159210255Y-93798201D01*
X159077101Y-93887171D01*
X158929142Y-93948458D01*
X158772075Y-93979700D01*
X158611925Y-93979700D01*
X158454858Y-93948458D01*
X158306899Y-93887171D01*
X158173745Y-93798201D01*
X158060499Y-93684955D01*
X157971529Y-93551801D01*
X157910242Y-93403842D01*
X157879000Y-93246775D01*
X157879000Y-93086625D01*
X157910242Y-92929558D01*
X157971529Y-92781599D01*
X158060499Y-92648445D01*
X158173745Y-92535199D01*
X158306899Y-92446229D01*
X158454858Y-92384942D01*
X158611925Y-92353700D01*
X158772075Y-92353700D01*
X158929142Y-92384942D01*
G37*
G36*
X139429142Y-92384942D02*
G01*
X139577101Y-92446229D01*
X139710255Y-92535199D01*
X139823501Y-92648445D01*
X139912471Y-92781599D01*
X139973758Y-92929558D01*
X140005000Y-93086625D01*
X140005000Y-93246775D01*
X139973758Y-93403842D01*
X139912471Y-93551801D01*
X139823501Y-93684955D01*
X139710255Y-93798201D01*
X139577101Y-93887171D01*
X139429142Y-93948458D01*
X139272075Y-93979700D01*
X139111925Y-93979700D01*
X138954858Y-93948458D01*
X138806899Y-93887171D01*
X138673745Y-93798201D01*
X138560499Y-93684955D01*
X138471529Y-93551801D01*
X138410242Y-93403842D01*
X138379000Y-93246775D01*
X138379000Y-93086625D01*
X138410242Y-92929558D01*
X138471529Y-92781599D01*
X138560499Y-92648445D01*
X138673745Y-92535199D01*
X138806899Y-92446229D01*
X138954858Y-92384942D01*
X139111925Y-92353700D01*
X139272075Y-92353700D01*
X139429142Y-92384942D01*
G37*
G36*
X152429142Y-90384942D02*
G01*
X152577101Y-90446229D01*
X152710255Y-90535199D01*
X152823501Y-90648445D01*
X152912471Y-90781599D01*
X152973758Y-90929558D01*
X153005000Y-91086625D01*
X153005000Y-91246775D01*
X152973758Y-91403842D01*
X152912471Y-91551801D01*
X152823501Y-91684955D01*
X152710255Y-91798201D01*
X152577101Y-91887171D01*
X152429142Y-91948458D01*
X152272075Y-91979700D01*
X152111925Y-91979700D01*
X151954858Y-91948458D01*
X151806899Y-91887171D01*
X151673745Y-91798201D01*
X151560499Y-91684955D01*
X151471529Y-91551801D01*
X151410242Y-91403842D01*
X151379000Y-91246775D01*
X151379000Y-91086625D01*
X151410242Y-90929558D01*
X151471529Y-90781599D01*
X151560499Y-90648445D01*
X151673745Y-90535199D01*
X151806899Y-90446229D01*
X151954858Y-90384942D01*
X152111925Y-90353700D01*
X152272075Y-90353700D01*
X152429142Y-90384942D01*
G37*
G36*
X158929142Y-90384942D02*
G01*
X159077101Y-90446229D01*
X159210255Y-90535199D01*
X159323501Y-90648445D01*
X159412471Y-90781599D01*
X159473758Y-90929558D01*
X159505000Y-91086625D01*
X159505000Y-91246775D01*
X159473758Y-91403842D01*
X159412471Y-91551801D01*
X159323501Y-91684955D01*
X159210255Y-91798201D01*
X159077101Y-91887171D01*
X158929142Y-91948458D01*
X158772075Y-91979700D01*
X158611925Y-91979700D01*
X158454858Y-91948458D01*
X158306899Y-91887171D01*
X158173745Y-91798201D01*
X158060499Y-91684955D01*
X157971529Y-91551801D01*
X157910242Y-91403842D01*
X157879000Y-91246775D01*
X157879000Y-91086625D01*
X157910242Y-90929558D01*
X157971529Y-90781599D01*
X158060499Y-90648445D01*
X158173745Y-90535199D01*
X158306899Y-90446229D01*
X158454858Y-90384942D01*
X158611925Y-90353700D01*
X158772075Y-90353700D01*
X158929142Y-90384942D01*
G37*
G36*
X145929142Y-90384942D02*
G01*
X146077101Y-90446229D01*
X146210255Y-90535199D01*
X146323501Y-90648445D01*
X146412471Y-90781599D01*
X146473758Y-90929558D01*
X146505000Y-91086625D01*
X146505000Y-91246775D01*
X146473758Y-91403842D01*
X146412471Y-91551801D01*
X146323501Y-91684955D01*
X146210255Y-91798201D01*
X146077101Y-91887171D01*
X145929142Y-91948458D01*
X145772075Y-91979700D01*
X145611925Y-91979700D01*
X145454858Y-91948458D01*
X145306899Y-91887171D01*
X145173745Y-91798201D01*
X145060499Y-91684955D01*
X144971529Y-91551801D01*
X144910242Y-91403842D01*
X144879000Y-91246775D01*
X144879000Y-91086625D01*
X144910242Y-90929558D01*
X144971529Y-90781599D01*
X145060499Y-90648445D01*
X145173745Y-90535199D01*
X145306899Y-90446229D01*
X145454858Y-90384942D01*
X145611925Y-90353700D01*
X145772075Y-90353700D01*
X145929142Y-90384942D01*
G37*
G36*
X139429142Y-90384942D02*
G01*
X139577101Y-90446229D01*
X139710255Y-90535199D01*
X139823501Y-90648445D01*
X139912471Y-90781599D01*
X139973758Y-90929558D01*
X140005000Y-91086625D01*
X140005000Y-91246775D01*
X139973758Y-91403842D01*
X139912471Y-91551801D01*
X139823501Y-91684955D01*
X139710255Y-91798201D01*
X139577101Y-91887171D01*
X139429142Y-91948458D01*
X139272075Y-91979700D01*
X139111925Y-91979700D01*
X138954858Y-91948458D01*
X138806899Y-91887171D01*
X138673745Y-91798201D01*
X138560499Y-91684955D01*
X138471529Y-91551801D01*
X138410242Y-91403842D01*
X138379000Y-91246775D01*
X138379000Y-91086625D01*
X138410242Y-90929558D01*
X138471529Y-90781599D01*
X138560499Y-90648445D01*
X138673745Y-90535199D01*
X138806899Y-90446229D01*
X138954858Y-90384942D01*
X139111925Y-90353700D01*
X139272075Y-90353700D01*
X139429142Y-90384942D01*
G37*
G36*
X139429142Y-88384942D02*
G01*
X139577101Y-88446229D01*
X139710255Y-88535199D01*
X139823501Y-88648445D01*
X139912471Y-88781599D01*
X139973758Y-88929558D01*
X140005000Y-89086625D01*
X140005000Y-89246775D01*
X139973758Y-89403842D01*
X139912471Y-89551801D01*
X139823501Y-89684955D01*
X139710255Y-89798201D01*
X139577101Y-89887171D01*
X139429142Y-89948458D01*
X139272075Y-89979700D01*
X139111925Y-89979700D01*
X138954858Y-89948458D01*
X138806899Y-89887171D01*
X138673745Y-89798201D01*
X138560499Y-89684955D01*
X138471529Y-89551801D01*
X138410242Y-89403842D01*
X138379000Y-89246775D01*
X138379000Y-89086625D01*
X138410242Y-88929558D01*
X138471529Y-88781599D01*
X138560499Y-88648445D01*
X138673745Y-88535199D01*
X138806899Y-88446229D01*
X138954858Y-88384942D01*
X139111925Y-88353700D01*
X139272075Y-88353700D01*
X139429142Y-88384942D01*
G37*
G36*
X145929142Y-88384942D02*
G01*
X146077101Y-88446229D01*
X146210255Y-88535199D01*
X146323501Y-88648445D01*
X146412471Y-88781599D01*
X146473758Y-88929558D01*
X146505000Y-89086625D01*
X146505000Y-89246775D01*
X146473758Y-89403842D01*
X146412471Y-89551801D01*
X146323501Y-89684955D01*
X146210255Y-89798201D01*
X146077101Y-89887171D01*
X145929142Y-89948458D01*
X145772075Y-89979700D01*
X145611925Y-89979700D01*
X145454858Y-89948458D01*
X145306899Y-89887171D01*
X145173745Y-89798201D01*
X145060499Y-89684955D01*
X144971529Y-89551801D01*
X144910242Y-89403842D01*
X144879000Y-89246775D01*
X144879000Y-89086625D01*
X144910242Y-88929558D01*
X144971529Y-88781599D01*
X145060499Y-88648445D01*
X145173745Y-88535199D01*
X145306899Y-88446229D01*
X145454858Y-88384942D01*
X145611925Y-88353700D01*
X145772075Y-88353700D01*
X145929142Y-88384942D01*
G37*
G36*
X152429142Y-88384942D02*
G01*
X152577101Y-88446229D01*
X152710255Y-88535199D01*
X152823501Y-88648445D01*
X152912471Y-88781599D01*
X152973758Y-88929558D01*
X153005000Y-89086625D01*
X153005000Y-89246775D01*
X152973758Y-89403842D01*
X152912471Y-89551801D01*
X152823501Y-89684955D01*
X152710255Y-89798201D01*
X152577101Y-89887171D01*
X152429142Y-89948458D01*
X152272075Y-89979700D01*
X152111925Y-89979700D01*
X151954858Y-89948458D01*
X151806899Y-89887171D01*
X151673745Y-89798201D01*
X151560499Y-89684955D01*
X151471529Y-89551801D01*
X151410242Y-89403842D01*
X151379000Y-89246775D01*
X151379000Y-89086625D01*
X151410242Y-88929558D01*
X151471529Y-88781599D01*
X151560499Y-88648445D01*
X151673745Y-88535199D01*
X151806899Y-88446229D01*
X151954858Y-88384942D01*
X152111925Y-88353700D01*
X152272075Y-88353700D01*
X152429142Y-88384942D01*
G37*
G36*
X158929142Y-88384942D02*
G01*
X159077101Y-88446229D01*
X159210255Y-88535199D01*
X159323501Y-88648445D01*
X159412471Y-88781599D01*
X159473758Y-88929558D01*
X159505000Y-89086625D01*
X159505000Y-89246775D01*
X159473758Y-89403842D01*
X159412471Y-89551801D01*
X159323501Y-89684955D01*
X159210255Y-89798201D01*
X159077101Y-89887171D01*
X158929142Y-89948458D01*
X158772075Y-89979700D01*
X158611925Y-89979700D01*
X158454858Y-89948458D01*
X158306899Y-89887171D01*
X158173745Y-89798201D01*
X158060499Y-89684955D01*
X157971529Y-89551801D01*
X157910242Y-89403842D01*
X157879000Y-89246775D01*
X157879000Y-89086625D01*
X157910242Y-88929558D01*
X157971529Y-88781599D01*
X158060499Y-88648445D01*
X158173745Y-88535199D01*
X158306899Y-88446229D01*
X158454858Y-88384942D01*
X158611925Y-88353700D01*
X158772075Y-88353700D01*
X158929142Y-88384942D01*
G37*
G36*
X159052585Y-80266802D02*
G01*
X159202410Y-80296604D01*
X159484674Y-80413521D01*
X159738705Y-80583259D01*
X159954741Y-80799295D01*
X160124479Y-81053326D01*
X160241396Y-81335590D01*
X160301000Y-81635240D01*
X160301000Y-81940760D01*
X160241396Y-82240410D01*
X160124479Y-82522674D01*
X159954741Y-82776705D01*
X159738705Y-82992741D01*
X159484674Y-83162479D01*
X159202410Y-83279396D01*
X159052585Y-83309198D01*
X158902761Y-83339000D01*
X158597239Y-83339000D01*
X158447415Y-83309198D01*
X158297590Y-83279396D01*
X158015326Y-83162479D01*
X157761295Y-82992741D01*
X157545259Y-82776705D01*
X157375521Y-82522674D01*
X157258604Y-82240410D01*
X157199000Y-81940760D01*
X157199000Y-81635240D01*
X157258604Y-81335590D01*
X157375521Y-81053326D01*
X157545259Y-80799295D01*
X157761295Y-80583259D01*
X158015326Y-80413521D01*
X158297590Y-80296604D01*
X158447415Y-80266802D01*
X158597239Y-80237000D01*
X158902761Y-80237000D01*
X159052585Y-80266802D01*
G37*
G36*
X139494585Y-80266802D02*
G01*
X139644410Y-80296604D01*
X139926674Y-80413521D01*
X140180705Y-80583259D01*
X140396741Y-80799295D01*
X140566479Y-81053326D01*
X140683396Y-81335590D01*
X140743000Y-81635240D01*
X140743000Y-81940760D01*
X140683396Y-82240410D01*
X140566479Y-82522674D01*
X140396741Y-82776705D01*
X140180705Y-82992741D01*
X139926674Y-83162479D01*
X139644410Y-83279396D01*
X139494585Y-83309198D01*
X139344761Y-83339000D01*
X139039239Y-83339000D01*
X138889415Y-83309198D01*
X138739590Y-83279396D01*
X138457326Y-83162479D01*
X138203295Y-82992741D01*
X137987259Y-82776705D01*
X137817521Y-82522674D01*
X137700604Y-82240410D01*
X137641000Y-81940760D01*
X137641000Y-81635240D01*
X137700604Y-81335590D01*
X137817521Y-81053326D01*
X137987259Y-80799295D01*
X138203295Y-80583259D01*
X138457326Y-80413521D01*
X138739590Y-80296604D01*
X138889415Y-80266802D01*
X139039239Y-80237000D01*
X139344761Y-80237000D01*
X139494585Y-80266802D01*
G37*
M02*
