{
  "images" : [
    {
      "filename" : "iconfinder_virus_sanitizer_personal_care_products_6012917.pdf",
      "idiom" : "universal"
    }
  ],
  "info" : {
    "author" : "xcode",
    "version" : 1
  }
}
