<?xml version="1.0" encoding="UTF-8" standalone="no"?>
<!-- Created with Inkscape (http://www.inkscape.org/) -->

<svg
   xmlns:dc="http://purl.org/dc/elements/1.1/"
   xmlns:cc="http://creativecommons.org/ns#"
   xmlns:rdf="http://www.w3.org/1999/02/22-rdf-syntax-ns#"
   xmlns:svg="http://www.w3.org/2000/svg"
   xmlns="http://www.w3.org/2000/svg"
   xmlns:sodipodi="http://sodipodi.sourceforge.net/DTD/sodipodi-0.dtd"
   xmlns:inkscape="http://www.inkscape.org/namespaces/inkscape"
   width="34.657459mm"
   height="34.657459mm"
   viewBox="0 0 34.657459 34.65746"
   version="1.1"
   id="svg14159"
   inkscape:version="0.92.5 (2060ec1f9f, 2020-04-08)"
   sodipodi:docname="icon.svg"
   inkscape:export-filename="/home/random/Development/album/repos/catalogs/capture-knowledge/gatsby/src/images/favicon.png"
   inkscape:export-xdpi="46.900002"
   inkscape:export-ydpi="46.900002">
  <defs
     id="defs14153" />
  <sodipodi:namedview
     id="base"
     pagecolor="#ffffff"
     bordercolor="#666666"
     borderopacity="1.0"
     inkscape:pageopacity="0.0"
     inkscape:pageshadow="2"
     inkscape:zoom="2.8"
     inkscape:cx="-63.454191"
     inkscape:cy="79.659879"
     inkscape:document-units="mm"
     inkscape:current-layer="g4972"
     showgrid="false"
     fit-margin-top="2"
     fit-margin-left="2"
     fit-margin-right="2"
     fit-margin-bottom="2"
     inkscape:window-width="1920"
     inkscape:window-height="1056"
     inkscape:window-x="0"
     inkscape:window-y="0"
     inkscape:window-maximized="1" />
  <metadata
     id="metadata14156">
    <rdf:RDF>
      <cc:Work
         rdf:about="">
        <dc:format>image/svg+xml</dc:format>
        <dc:type
           rdf:resource="http://purl.org/dc/dcmitype/StillImage" />
        <dc:title />
      </cc:Work>
    </rdf:RDF>
  </metadata>
  <g
     inkscape:label="Layer 1"
     inkscape:groupmode="layer"
     id="layer1"
     transform="translate(-75.653415,-121.93336)">
    <g
       transform="matrix(0.63162133,0,0,0.63162133,4.6577243,55.652533)"
       id="g5096">
      <g
         transform="matrix(1.4344177,0,0,1.4344177,15.536528,-56.767846)"
         id="g4972"
         style="stroke:none">
        <rect
           style="opacity:1;fill:#680fc1;fill-opacity:1;stroke:none;stroke-width:0.90385282;stroke-linecap:round;stroke-linejoin:round;stroke-miterlimit:4;stroke-dasharray:none;stroke-dashoffset:0;stroke-opacity:1"
           id="rect4945"
           width="11.111966"
           height="11.111966"
           x="68.1959"
           y="113.58317"
           rx="1.8127818"
           ry="1.8127818" />
        <rect
           y="113.58317"
           x="81.060051"
           height="11.111966"
           width="11.111966"
           id="rect4947"
           style="opacity:1;fill:#0f86c1;fill-opacity:1;stroke:none;stroke-width:0.90385282;stroke-linecap:round;stroke-linejoin:round;stroke-miterlimit:4;stroke-dasharray:none;stroke-dashoffset:0;stroke-opacity:1"
           rx="1.8127818"
           ry="1.8127818" />
        <rect
           style="opacity:1;fill:#60c2f3;fill-opacity:1;stroke:none;stroke-width:0.90385282;stroke-linecap:round;stroke-linejoin:round;stroke-miterlimit:4;stroke-dasharray:none;stroke-dashoffset:0;stroke-opacity:1"
           id="rect4949"
           width="11.111966"
           height="11.111966"
           x="93.924194"
           y="113.58317"
           rx="1.8127818"
           ry="1.8127818" />
        <rect
           y="126.44731"
           x="68.1959"
           height="11.111966"
           width="11.111966"
           id="rect4951"
           style="opacity:1;fill:#0fc180;fill-opacity:1;stroke:none;stroke-width:0.90385282;stroke-linecap:round;stroke-linejoin:round;stroke-miterlimit:4;stroke-dasharray:none;stroke-dashoffset:0;stroke-opacity:1"
           rx="1.8127818"
           ry="1.8127818" />
        <rect
           style="opacity:1;fill:#c3ef3b;fill-opacity:1;stroke:none;stroke-width:0.90385282;stroke-linecap:round;stroke-linejoin:round;stroke-miterlimit:4;stroke-dasharray:none;stroke-dashoffset:0;stroke-opacity:1"
           id="rect4953"
           width="11.111966"
           height="11.111966"
           x="81.060051"
           y="126.44731"
           rx="1.8127818"
           ry="1.8127818" />
        <rect
           y="126.44731"
           x="93.924194"
           height="11.111966"
           width="11.111966"
           id="rect4955"
           style="opacity:1;fill:#c18b0f;fill-opacity:1;stroke:none;stroke-width:0.90385282;stroke-linecap:round;stroke-linejoin:round;stroke-miterlimit:4;stroke-dasharray:none;stroke-dashoffset:0;stroke-opacity:1"
           rx="1.8127818"
           ry="1.8127818" />
        <rect
           style="opacity:1;fill:#0fc1ba;fill-opacity:1;stroke:none;stroke-width:0.90385282;stroke-linecap:round;stroke-linejoin:round;stroke-miterlimit:4;stroke-dasharray:none;stroke-dashoffset:0;stroke-opacity:1"
           id="rect4957"
           width="11.111966"
           height="11.111966"
           x="68.1959"
           y="139.31146"
           rx="1.8127818"
           ry="1.8127818" />
        <rect
           y="139.31146"
           x="81.060051"
           height="11.111966"
           width="11.111966"
           id="rect4959"
           style="opacity:1;fill:#a30fc1;fill-opacity:1;stroke:none;stroke-width:0.90385282;stroke-linecap:round;stroke-linejoin:round;stroke-miterlimit:4;stroke-dasharray:none;stroke-dashoffset:0;stroke-opacity:1"
           rx="1.8127818"
           ry="1.8127818" />
        <rect
           style="opacity:1;fill:#c1430f;fill-opacity:1;stroke:none;stroke-width:0.90385282;stroke-linecap:round;stroke-linejoin:round;stroke-miterlimit:4;stroke-dasharray:none;stroke-dashoffset:0;stroke-opacity:1"
           id="rect4961"
           width="11.111966"
           height="11.111966"
           x="93.924194"
           y="139.31146"
           rx="1.8127818"
           ry="1.8127818" />
      </g>
    </g>
  </g>
</svg>
