{
  "shell_port": 35973,
  "iopub_port": 51607,
  "stdin_port": 52071,
  "control_port": 56399,
  "hb_port": 38951,
  "ip": "127.0.0.1",
  "key": "913006a6-78c795e59f4e169f2fcb80be",
  "transport": "tcp",
  "signature_scheme": "hmac-sha256",
  "kernel_name": ""
}