<?xml version="1.0" encoding="UTF-8" standalone="no"?>
<!-- Created with Inkscape (http://www.inkscape.org/) -->

<svg
   version="1.1"
   id="svg100055"
   width="32"
   height="32"
   viewBox="0 0 32 32"
   sodipodi:docname="favicon.svg"
   inkscape:version="1.1.1 (3bf5ae0d25, 2021-09-20)"
   xmlns:inkscape="http://www.inkscape.org/namespaces/inkscape"
   xmlns:sodipodi="http://sodipodi.sourceforge.net/DTD/sodipodi-0.dtd"
   xmlns:xlink="http://www.w3.org/1999/xlink"
   xmlns="http://www.w3.org/2000/svg"
   xmlns:svg="http://www.w3.org/2000/svg">
  <defs
     id="defs100059">
    <linearGradient
       inkscape:collect="always"
       xlink:href="#linearGradient64278"
       id="linearGradient64280"
       x1="-139.85277"
       y1="77.059113"
       x2="-21.603279"
       y2="77.059113"
       gradientUnits="userSpaceOnUse"
       gradientTransform="matrix(1.0829003,0,0,1.0992093,161.74638,1.3677545)" />
    <linearGradient
       id="linearGradient64278"
       inkscape:swatch="solid">
      <stop
         style="stop-color:#2f74b5;stop-opacity:1;"
         offset="0"
         id="stop64276" />
    </linearGradient>
  </defs>
  <sodipodi:namedview
     id="namedview100057"
     pagecolor="#ffffff"
     bordercolor="#666666"
     borderopacity="1.0"
     inkscape:pageshadow="2"
     inkscape:pageopacity="0.0"
     inkscape:pagecheckerboard="0"
     showgrid="false"
     inkscape:zoom="16"
     inkscape:cx="15.96875"
     inkscape:cy="6.03125"
     inkscape:window-width="1366"
     inkscape:window-height="697"
     inkscape:window-x="-8"
     inkscape:window-y="-8"
     inkscape:window-maximized="1"
     inkscape:current-layer="g100061" />
  <g
     inkscape:groupmode="layer"
     inkscape:label="Image"
     id="g100061">
    <g
       id="g100031"
       transform="matrix(0.21411704,0,0,0.23219399,0.15941556,-0.27824417)">
      <rect
         style="fill:url(#linearGradient64280);fill-opacity:1;fill-rule:evenodd;stroke-width:1.1584"
         id="rect121"
         width="128.05241"
         height="107.4262"
         x="10.299774"
         y="32.358749"
         ry="20.673082" />
      <rect
         style="fill:#ffffff;fill-opacity:1;stroke-width:1.28814"
         id="rect6462"
         width="90.806396"
         height="18.729166"
         x="28.922783"
         y="62.939316"
         ry="9.364583" />
      <ellipse
         style="fill:#000000;fill-opacity:1;stroke-width:1.19966"
         id="path6729-5"
         cx="44.797577"
         cy="72.294853"
         rx="5.0790019"
         ry="5.3117204" />
      <ellipse
         style="fill:#000000;fill-opacity:1;stroke-width:1.19966"
         id="path6729-5-0"
         cx="104.48112"
         cy="72.294853"
         rx="5.0790019"
         ry="5.3117204" />
      <rect
         style="fill:#4670c6;fill-opacity:1;stroke-width:0.883043"
         id="rect7482"
         width="10.77364"
         height="26.246149"
         x="-0.16603655"
         y="67.295586"
         ry="3.1245415" />
      <rect
         style="fill:#4771c0;fill-opacity:1;stroke-width:0.883043"
         id="rect7482-8"
         width="10.77364"
         height="26.246149"
         x="138.19829"
         y="67.295586"
         ry="3.1245415" />
      <rect
         style="fill:#4b72bd;fill-opacity:1;stroke-width:0.950909"
         id="rect8426"
         width="8.6189127"
         height="15.665298"
         x="70.016525"
         y="17.260326"
         ry="0" />
      <ellipse
         style="fill:#4b72bd;fill-opacity:1;stroke-width:1.25041"
         id="path8280"
         cx="74.325981"
         cy="10.298146"
         rx="20.355047"
         ry="9.6014757" />
      <ellipse
         style="fill:#ffffff;fill-opacity:1;stroke-width:0.732998"
         id="path8280-5"
         cx="74.325981"
         cy="10.169642"
         rx="12.313546"
         ry="5.4541359" />
      <path
         style="fill:none;fill-opacity:1;stroke:#fefdf9;stroke-width:5;stroke-miterlimit:4;stroke-dasharray:none;stroke-opacity:1"
         id="path64466"
         sodipodi:type="arc"
         sodipodi:cx="74.325516"
         sodipodi:cy="102.32323"
         sodipodi:rx="23.030565"
         sodipodi:ry="12.040526"
         sodipodi:start="0"
         sodipodi:end="3.1876344"
         sodipodi:open="true"
         sodipodi:arc-type="arc"
         d="M 97.356081,102.32323 A 23.030565,12.040526 0 0 1 85.533353,112.84179 23.030565,12.040526 0 0 1 62.20355,112.56096 23.030565,12.040526 0 0 1 51.319357,101.76906" />
    </g>
  </g>
</svg>
