<?xml version="1.0" encoding="UTF-8" standalone="no"?>
<!-- Created with Inkscape (http://www.inkscape.org/) -->

<svg
   version="1.1"
   id="svg9"
   width="92.082642"
   height="63.39053"
   viewBox="0 0 92.082639 63.390534"
   sodipodi:docname="logo_spertatek_guest-1.svg"
   inkscape:version="1.1.1 (3bf5ae0d25, 2021-09-20)"
   xmlns:inkscape="http://www.inkscape.org/namespaces/inkscape"
   xmlns:sodipodi="http://sodipodi.sourceforge.net/DTD/sodipodi-0.dtd"
   xmlns:xlink="http://www.w3.org/1999/xlink"
   xmlns="http://www.w3.org/2000/svg"
   xmlns:svg="http://www.w3.org/2000/svg">
  <defs
     id="defs13">
    <rect
       x="-91.061195"
       y="122.71051"
       width="307.60916"
       height="58.856625"
       id="rect9821" />
    <linearGradient
       id="linearGradient66327"
       inkscape:swatch="solid">
      <stop
         style="stop-color:#2f74b5;stop-opacity:1;"
         offset="0"
         id="stop66325" />
    </linearGradient>
    <linearGradient
       id="linearGradient64278"
       inkscape:swatch="solid">
      <stop
         style="stop-color:#2f74b5;stop-opacity:1;"
         offset="0"
         id="stop64276" />
    </linearGradient>
    <radialGradient
       inkscape:collect="always"
       xlink:href="#linearGradient64278"
       id="radialGradient838"
       gradientUnits="userSpaceOnUse"
       gradientTransform="matrix(0.48,0,0,0.40268336,-5.0802011,1.2015455)"
       cx="74.325981"
       cy="86.071854"
       fx="74.325981"
       fy="86.071854"
       r="64.026207" />
    <rect
       x="-91.061195"
       y="122.71051"
       width="307.60916"
       height="58.856625"
       id="rect9821-8" />
  </defs>
  <sodipodi:namedview
     id="namedview11"
     pagecolor="#ffffff"
     bordercolor="#666666"
     borderopacity="1.0"
     inkscape:pageshadow="2"
     inkscape:pageopacity="0.0"
     inkscape:pagecheckerboard="0"
     showgrid="false"
     inkscape:zoom="1.8009867"
     inkscape:cx="51.915986"
     inkscape:cy="44.69772"
     inkscape:window-width="1360"
     inkscape:window-height="697"
     inkscape:window-x="-8"
     inkscape:window-y="52"
     inkscape:window-maximized="1"
     inkscape:current-layer="g15" />
  <g
     inkscape:groupmode="layer"
     inkscape:label="Image"
     id="g15"
     transform="translate(42.216638,-40.324436)">
    <g
       id="g14464"
       transform="matrix(0.5,0,0,0.5,16.281328,42.883855)">
      <rect
         style="fill:url(#radialGradient838);fill-opacity:1;fill-rule:evenodd;stroke-width:0.556032"
         id="rect121"
         width="61.46516"
         height="51.564575"
         x="-0.13630962"
         y="10.078959"
         ry="9.9230795" />
      <rect
         style="fill:#ffffff;fill-opacity:1;stroke-width:0.616416"
         id="rect6462"
         width="43.320881"
         height="8.9899998"
         x="9.0689249"
         y="24.757631"
         ry="4.4949999" />
      <ellipse
         style="fill:#000000;fill-opacity:1;stroke-width:0.575837"
         id="path6729-5"
         cx="16.422636"
         cy="29.248287"
         rx="2.437921"
         ry="2.5496259" />
      <ellipse
         style="fill:#000000;fill-opacity:1;stroke-width:0.575837"
         id="path6729-5-0"
         cx="45.070736"
         cy="29.248287"
         rx="2.437921"
         ry="2.5496259" />
      <rect
         style="fill:#4670c6;fill-opacity:1;stroke-width:0.423861"
         id="rect7482"
         width="5.1713471"
         height="12.598151"
         x="-5.1598988"
         y="26.848642"
         ry="1.4997799" />
      <rect
         style="fill:#4771c0;fill-opacity:1;stroke-width:0.423861"
         id="rect7482-8"
         width="5.1713471"
         height="12.598151"
         x="61.254974"
         y="26.848642"
         ry="1.4997799" />
      <rect
         style="fill:#4b72bd;fill-opacity:1;stroke-width:0.456436"
         id="rect8426"
         width="4.1370783"
         height="7.5193434"
         x="28.527733"
         y="2.8317161"
         ry="0" />
      <ellipse
         style="fill:#4b72bd;fill-opacity:1;stroke-width:0.600197"
         id="path8280"
         cx="30.59627"
         cy="-0.51013058"
         rx="9.770422"
         ry="4.6087084" />
      <ellipse
         style="fill:#ffffff;fill-opacity:1;stroke-width:0.351839"
         id="path8280-5"
         cx="30.59627"
         cy="-0.57181233"
         rx="5.9105024"
         ry="2.6179852" />
      <path
         style="fill:none;fill-opacity:1;stroke:#fefdf9;stroke-width:3;stroke-miterlimit:4;stroke-dasharray:none;stroke-opacity:1"
         id="path64466"
         sodipodi:type="arc"
         sodipodi:cx="30.596048"
         sodipodi:cy="43.661907"
         sodipodi:rx="11.054671"
         sodipodi:ry="5.7794523"
         sodipodi:start="0"
         sodipodi:end="3.140996"
         sodipodi:arc-type="arc"
         d="M 41.65072,43.661907 A 11.054671,5.7794523 0 0 1 30.599346,49.441359 11.054671,5.7794523 0 0 1 19.541379,43.665356"
         sodipodi:open="true" />
    </g>
    <text
       xml:space="preserve"
       transform="matrix(0.61971673,0.00139488,-0.00211109,0.73354321,15.74312,-19.379692)"
       id="text9819"
       style="font-style:normal;font-variant:normal;font-weight:normal;font-stretch:normal;font-size:40px;line-height:1.25;font-family:'Yu Gothic UI';-inkscape-font-specification:'Yu Gothic UI, Normal';font-variant-ligatures:normal;font-variant-caps:normal;font-variant-numeric:normal;font-variant-east-asian:normal;white-space:pre;shape-inside:url(#rect9821);fill:#44aa00;fill-opacity:1;stroke:none"><tspan
         x="-91.060547"
         y="158.74111"
         id="tspan869">pertatek</tspan></text>
    <text
       xml:space="preserve"
       transform="matrix(1.7146248,0.00269303,-0.00584095,1.416217,110.79583,-143.90753)"
       id="text9819-8"
       style="font-style:normal;font-variant:normal;font-weight:normal;font-stretch:normal;font-size:40px;line-height:1.25;font-family:'Yu Gothic UI';-inkscape-font-specification:'Yu Gothic UI, Normal';font-variant-ligatures:normal;font-variant-caps:normal;font-variant-numeric:normal;font-variant-east-asian:normal;white-space:pre;shape-inside:url(#rect9821-8);fill:#44aa00;fill-opacity:1;stroke:none;stroke-width:0.0163927;stroke-miterlimit:4;stroke-dasharray:none"><tspan
         x="-91.060547"
         y="158.74111"
         id="tspan871">S</tspan></text>
  </g>
</svg>
