{
	"apps" : [
		{
			"name":		"Mioga3",
			"script":	"./src/main.js",
			"watch":	["./src/", "./config/"],
			"env": {
				"NODE_ENV": "development"
			},
			"autorestart": false,
			"interpreter": "./node_modules/.bin/babel-node",
			"log_date_format": "YYYY-MM-DD HH:mm Z",
			"merge_logs": true,
			"log_file": "./logs/development.log"
		}
	]
}
