latitude,longitude,altitude.meters,timestamp,ash,so2
51.0,17.0,0,1568209567,0.0,0.0
51.0,17.0,0,1568209611,0.0,0.0
51.0,17.0,0,1568209636,0.0,0.0
51.0,17.0,0,1568209659,0.0,0.0
51.0,17.0,0,1568209801,0.0,0.0
51.0,17.0,0,1568209810,0.0,0.0
51.0,17.0,0,1568209819,0.0,0.0
51.0,17.0,0,1568209825,0.0,0.0
51.0,17.0,0,1568209831,0.0,0.0
51.0,17.0,0,1568209840,0.0,0.0
51.0,17.0,0,1568209846,0.0,0.0
51.0,17.0,0,1568209861,0.0,0.0
51.0,17.0,0,1568209871,0.0,0.0
51.0,17.0,0,1568209884,0.0,0.0
51.0,17.0,0,1568209890,0.0,0.0
51.0,17.0,0,1568209901,0.0,0.0
51.0,16.75,0,1568209908,0.0,0.0
51.0,16.75,0,1568209916,0.0,0.0
51.0,16.75,0,1568209924,0.0,0.0
51.0,16.75,0,1568209933,0.0,0.0
51.0,16.75,0,1568209939,0.0,0.0
51.0,16.75,0,1568209945,0.0,0.0
51.0,16.75,0,1568209951,0.0,0.0
51.0,16.75,0,1568209961,0.0,0.0
51.0,16.75,0,1568210044,0.0,0.0
51.0,16.75,0,1568210073,0.0,0.0
51.0,16.75,0,1568210079,0.0,0.0
51.0,16.75,0,1568210085,0.0,0.0
51.0,16.75,0,1568210092,0.0,0.0
51.0,16.75,0,1568210099,0.0,0.0
51.0,16.75,0,1568210106,0.0,0.0
51.0,16.75,0,1568210115,0.0,0.0
51.0,16.75,0,1568210122,0.0,0.0
51.0,16.75,0,1568210130,0.0,0.0
51.0,16.75,0,1568210139,0.0,0.0
51.0,16.75,0,1568210146,0.0,0.0
51.0,16.75,0,1568210154,0.0,0.0
51.0,16.75,0,1568210161,0.0,0.0
51.0,16.75,0,1568210171,0.0,0.0
51.0,16.75,0,1568210177,0.0,0.0
51.0,16.75,0,1568210183,0.0,0.0
51.0,16.75,0,1568210190,0.0,0.0
51.0,16.75,0,1568210197,0.0,0.0
51.0,16.75,0,1568210204,0.0,0.0
51.0,17.0,38,1568210218,0.0,0.0
51.0,17.0,76,1568210225,0.0,0.0
51.0,17.0,152,1568210231,0.0,0.0
51.0,17.0,312,1568210243,0.0,0.0
51.0,17.0,396,1568210249,0.0,0.0
51.0,17.0,480,1568210256,0.0,0.0
51.0,17.0,526,1568210262,0.0,0.0
51.0,17.0,610,1568210274,0.0,0.0
51.0,17.0,655,1568210281,0.0,0.0
51.0,17.0,709,1568210288,0.0,0.0
51.0,17.0,815,1568210298,0.0,0.0
51.0,17.0,869,1568210304,0.0,0.0
51.0,17.0,899,1568210310,0.0,0.0
51.0,17.0,937,1568210317,0.0,0.0
51.0,17.0,1029,1568210328,0.0,0.0
51.0,17.0,1052,1568210334,0.0,0.0
51.0,17.0,1090,1568210342,0.0,0.0
51.0,17.0,1135,1568210353,0.0,0.0
51.0,17.0,1158,1568210359,0.0,0.0
51.0,17.0,1173,1568210366,0.0,0.0
51.0,17.0,1204,1568210372,0.0,0.0
51.0,17.0,1227,1568210378,0.0,0.0
51.0,17.0,1242,1568210384,0.0,0.0
51.0,17.0,1273,1568210391,0.0,0.0
51.0,17.0,1326,1568210397,0.0,0.0
51.0,17.0,1425,1568210405,0.0,0.0
51.0,17.0,1509,1568210412,0.0,0.0
51.0,17.25,1585,1568210418,0.0,0.0
51.0,17.25,1661,1568210425,0.0,0.0
51.0,17.25,1730,1568210431,0.0,0.0
51.0,17.25,1806,1568210437,0.0,0.0
51.0,17.25,1897,1568210443,0.0,0.0
51.0,17.25,2004,1568210450,0.0,0.0
51.25,17.25,2172,1568210459,0.0,0.0
51.25,17.25,2461,1568210477,0.0,0.0
51.25,17.0,2629,1568210489,0.0,0.0
51.25,17.0,2819,1568210502,0.0,0.0
51.25,17.0,2964,1568210515,0.0,0.0
51.25,17.0,3139,1568210527,0.0,0.0
51.25,17.0,3254,1568210539,0.0,0.0
51.25,17.0,3322,1568210551,0.0,0.0
51.25,17.0,3383,1568210564,0.0,0.0
51.25,17.0,3620,1568210590,0.0,0.0
51.25,17.0,3757,1568210602,0.0,0.0
51.5,17.0,4183,1568210635,0.0,0.0
51.5,17.0,4587,1568210669,0.0,0.0
51.5,17.0,4884,1568210698,0.0,0.0
51.5,17.0,5121,1568210723,0.0,0.0
51.5,17.0,5204,1568210732,0.0,0.0
51.5,17.0,5319,1568210740,0.0,0.0
51.5,17.0,5387,1568210747,0.0,0.0
51.5,17.0,5441,1568210753,0.0,0.0
51.75,16.75,6104,1568210824,0.0,0.0
51.75,16.75,6637,1568210883,0.0,0.0
52.0,16.75,7132,1568210948,0.0,0.0
52.0,16.5,7559,1568211008,0.0,0.0
52.0,16.5,8001,1568211072,0.0,0.0
52.0,16.5,8039,1568211078,0.0,0.0
52.25,16.25,8512,1568211165,0.0,0.0
52.25,16.0,8824,1568211227,0.0,0.0
52.5,16.0,9350,1568211292,0.0,0.0
52.5,15.75,9822,1568211355,0.0,0.0
52.75,15.75,10135,1568211419,0.0,0.0
52.75,15.5,10363,1568211480,0.0,0.0
52.75,15.5,10363,1568211542,0.0,0.0
53.0,15.25,10363,1568211608,0.0,0.0
53.0,15.25,10378,1568211671,0.0,0.0
53.25,15.0,10371,1568211733,0.0,0.0
53.25,15.0,10363,1568211768,0.0,0.0
53.25,15.0,10348,1568211824,0.0,0.0
53.5,14.75,10363,1568211898,0.0,0.0
53.5,14.5,10363,1568211983,0.0,0.0
53.5,14.5,10363,1568212047,0.0,0.0
53.75,14.5,10363,1568212081,0.0,0.0
53.75,14.25,10363,1568212171,0.0,0.0
54.0,14.0,10363,1568212232,0.0,0.0
54.0,14.0,10363,1568212294,0.0,0.0
54.0,13.75,10363,1568212358,0.0,0.0
54.25,13.75,10371,1568212419,0.0,0.0
54.25,13.5,10356,1568212481,0.0,0.0
54.5,13.5,10363,1568212545,0.0,0.0
54.5,13.25,10371,1568212609,0.0,0.0
54.5,13.25,10363,1568212672,0.0,0.0
54.75,13.0,10371,1568212735,0.0,0.0
54.75,13.0,10363,1568212798,0.0,0.0
55.0,12.75,10363,1568212857,0.0,0.0
55.0,12.75,10363,1568212921,0.0,0.0
55.0,12.5,10363,1568212984,0.0,0.0
55.25,12.25,10363,1568213047,0.0,0.0
55.25,12.25,10363,1568213111,0.0,0.0
55.5,12.0,10363,1568213174,0.0,0.0
55.5,12.0,10363,1568213237,0.0,0.0
55.75,11.75,10363,1568213301,0.0,0.0
55.75,11.75,10356,1568213364,0.0,0.0
55.75,11.5,10363,1568213427,0.0,0.0
56.0,11.25,10363,1568213489,0.0,0.0
56.0,11.25,10371,1568213553,0.0,0.0
56.25,11.0,10371,1568213612,0.0,0.0
56.25,11.0,10363,1568213674,0.0,0.0
56.25,10.75,10356,1568213744,0.0,0.0
56.5,10.5,10363,1568213806,0.0,0.0
56.5,10.5,10363,1568213868,0.0,0.0
56.75,10.25,10356,1568213934,0.0,0.0
56.75,10.0,10371,1568213996,0.0,0.0
56.75,10.0,10378,1568214062,0.0,0.0
57.0,9.75,10363,1568214122,0.0,0.0
57.0,9.5,10363,1568214187,0.0,0.0
57.25,9.5,10371,1568214249,0.0,0.0
57.25,9.25,10371,1568214312,0.0,0.0
57.25,9.25,10371,1568214374,0.0,0.0
57.5,9.0,10363,1568214436,0.0,0.0
57.5,8.75,10356,1568214499,0.0,0.0
57.75,8.75,10363,1568214562,0.0,0.0
57.75,8.5,10356,1568214622,0.0,0.0
57.75,8.25,10363,1568214686,0.0,0.0
58.0,8.25,10363,1568214750,0.0,0.0
58.0,8.0,10363,1568214812,0.0,0.0
58.25,7.75,10371,1568214876,0.0,0.0
58.25,7.75,10363,1568214938,0.0,0.0
58.25,7.5,10363,1568215000,0.0,0.0
58.5,7.25,10356,1568215062,0.0,0.0
58.5,7.25,10356,1568215125,0.0,0.0
58.75,7.0,10371,1568215189,0.0,0.0
58.75,6.75,10363,1568215252,0.0,0.0
58.75,6.75,10371,1568215314,0.0,0.0
59.0,6.5,10371,1568215378,0.0,0.0
59.0,6.25,10363,1568215438,0.0,0.0
59.0,6.25,10356,1568215501,0.0,0.0
59.25,6.0,10363,1568215564,0.0,0.0
59.25,5.75,10348,1568215626,0.0,0.0
59.25,5.75,10356,1568215690,0.0,0.0
59.5,5.5,10371,1568215754,0.0,0.0
59.5,5.25,10371,1568215814,0.0,0.0
59.75,5.0,10371,1568215877,0.0,0.0
59.75,5.0,10363,1568215960,0.0,0.0
59.75,4.75,10371,1568216022,0.0,0.0
60.0,4.5,10371,1568216073,0.0,0.0
60.0,4.25,10363,1568216165,0.0,0.0
60.25,4.25,10356,1568216226,0.0,0.0
60.25,4.0,10363,1568216287,0.0,0.0
60.25,3.75,10363,1568216349,0.0,0.0
60.5,3.5,10363,1568216409,0.0,0.0
60.5,3.5,10363,1568216469,0.0,0.0
60.5,3.25,10363,1568216532,0.0,0.0
60.75,3.0,10371,1568216595,0.0,0.0
60.75,3.0,10363,1568216657,0.0,0.0
60.75,2.75,10363,1568216719,0.0,0.0
61.0,2.5,10371,1568216782,0.0,0.0
61.0,2.25,10622,1568216846,0.0,0.0
61.0,2.25,10942,1568216909,0.0,0.0
61.25,2.0,10973,1568216969,0.0,0.0
61.25,1.75,10973,1568217004,0.0,0.0
61.25,1.5,10973,1568217097,0.0,0.0
61.5,1.5,10973,1568217159,0.0,0.0
61.5,1.25,10980,1568217220,0.0,0.0
61.5,1.0,10980,1568217282,0.0,0.0
61.75,0.75,10980,1568217342,0.0,0.0
61.75,0.75,10965,1568217407,0.0,0.0
61.75,0.5,10973,1568217469,0.0,0.0
61.75,0.25,10980,1568217511,0.0,0.0
62.0,0.0,10965,1568217586,0.0,0.0
62.0,-0.25,10980,1568217679,0.0,0.0
62.0,-0.5,10973,1568217741,0.0,0.0
62.25,-0.75,10973,1568217803,0.0,0.0
62.25,-1.0,10965,1568217864,0.0,0.0
62.25,-1.25,10965,1568217924,0.0,0.0
62.25,-1.5,10980,1568217987,0.0,0.0
62.25,-1.75,10973,1568218047,0.0,0.0
62.25,-2.0,10973,1568218111,0.0,0.0
62.25,-2.25,10980,1568218174,0.0,0.0
62.5,-2.5,10973,1568218235,0.0,0.0
62.5,-2.75,10973,1568218300,0.0,0.0
62.5,-3.0,10973,1568218364,0.0,0.0
62.5,-3.25,10973,1568218428,0.0,0.0
62.5,-3.5,10973,1568218489,0.0,0.0
62.5,-3.75,10965,1568218553,0.0,0.0
62.5,-3.75,10973,1568218589,0.0,0.0
62.75,-4.25,10973,1568218680,0.0,0.0
62.75,-4.5,10973,1568218741,0.0,0.0
62.75,-4.75,10973,1568218803,0.0,0.0
62.75,-5.0,10973,1568218863,0.0,0.0
62.75,-5.0,10973,1568218923,0.0,0.0
62.75,-5.25,10973,1568218987,0.0,0.0
62.75,-5.5,10973,1568219049,0.0,0.0
63.0,-5.75,10973,1568219109,0.0,0.0
63.0,-6.0,10965,1568219171,0.0,0.0
63.0,-6.25,10973,1568219200,0.0,0.0
63.0,-6.5,10973,1568219245,0.0,0.0
63.0,-6.75,10980,1568219333,0.0,0.0
63.0,-7.0,10965,1568219401,0.0,0.0
63.0,-7.0,10973,1568219422,0.0,0.0
63.25,-8.0,10980,1568219617,0.0,0.0
63.25,-8.25,10973,1568219680,0.0,0.0
63.25,-8.5,10973,1568219740,0.0,0.0
63.25,-8.75,10980,1568219803,0.0,0.0
63.25,-9.0,10980,1568219864,0.0,0.0
63.25,-9.25,10973,1568219926,0.0,0.0
63.25,-9.5,10965,1568219986,0.0,0.0
63.25,-9.5,10965,1568220022,0.0,0.0
63.25,-10.0,10980,1568220112,0.0,0.0
63.25,-10.25,10980,1568220172,0.0,0.0
63.5,-10.5,10973,1568220234,0.0,0.0
63.5,-10.75,10973,1568220295,0.0,0.0
63.5,-11.0,10965,1568220357,0.0,0.0
63.5,-11.25,10973,1568220418,0.0,0.0
63.5,-11.5,10973,1568220479,0.0,0.0
63.5,-11.75,10973,1568220541,0.0,0.0
63.5,-12.0,10973,1568220601,2.654591391149097e-08,8.18516126188315e-14
63.5,-12.25,10973,1568220662,3.581162033583496e-08,9.43969091803977e-14
63.5,-12.5,10973,1568220723,5.156695692676294e-08,1.194981749186655e-13
63.5,-12.75,10973,1568220783,6.855572820541056e-08,1.50973024771843e-13
63.5,-13.0,10973,1568220845,0.00046464602928608656,1.9078457617980465e-13
63.5,-13.25,10973,1568220905,0.018857620656490326,2.390423471144987e-13
63.75,-13.5,10973,1568220969,4.5801293424574396e-08,1.770291676922095e-13
63.75,-13.75,10973,1568221031,4.6071505721556605e-08,2.1084378004371934e-13
63.75,-14.0,10980,1568221091,5.397976465815191e-08,2.358955045189681e-13
63.75,-14.25,10973,1568221151,0.0006897193961776793,2.5476701911303357e-13
63.75,-14.5,10973,1568221215,0.0026524944696575403,2.7167732039729e-13
63.75,-14.75,10973,1568221277,0.0065901149064302444,2.834596164562331e-13
63.75,-15.25,10973,1568221337,0.07426784932613373,2.4658202454723444e-13
63.75,-15.5,10973,1568221401,0.1992766559123993,2.0201230282752142e-13
63.75,-15.75,10973,1568221461,0.2020231932401657,1.7164892283146743e-13
63.75,-16.0,10973,1568221523,0.1273329108953476,1.5277948177405687e-13
63.75,-16.25,10973,1568221585,0.05236036702990532,1.409721541974565e-13
63.75,-16.5,10973,1568221649,0.038859084248542786,1.312989430721223e-13
63.75,-16.75,10973,1568221709,0.048843491822481155,1.2185012113891114e-13
63.75,-17.0,10973,1568221771,0.04806326702237129,1.1086226066932964e-13
63.75,-17.25,10973,1568221831,0.19379332661628723,9.897364503484718e-14
63.75,-17.5,10973,1568221894,1.2394436597824097,9.34113287480269e-14
63.75,-17.75,10973,1568221955,3.293731927871704,9.660390434644561e-14
63.75,-18.25,10790,1568222016,4.447351455688477,9.462871838113868e-14
64.0,-18.5,10333,1568222076,0.9044758677482605,1.3930344508125692e-14
64.0,-18.75,9655,1568222139,0.00017500318062957376,4.388450237328193e-17
64.0,-19.0,8976,1568222201,3.619799463194795e-05,7.447856480449881e-18
64.0,-19.25,8420,1568222262,0.06329302489757538,4.340232183702222e-19
64.0,-19.25,7948,1568222304,1.4971669912338257,5.866426599459748e-22
64.0,-19.75,7079,1568222397,1.0173872709274292,2.229362570010375e-22
64.0,-20.0,6515,1568222457,0.0001691600336926058,7.846602702045165e-25
64.0,-20.0,6363,1568222472,0.0001691600336926058,7.846602702045165e-25
64.0,-20.25,5456,1568222563,0.1330067366361618,1.1941291233778966e-24
64.0,-20.5,5166,1568222596,0.7550068497657776,1.6184608139626524e-27
64.0,-20.5,4854,1568222630,0.7550068497657776,1.6184608139626524e-27
64.0,-20.75,4549,1568222662,0.4579581618309021,2.1233697341240044e-27
64.0,-20.75,4282,1568222694,0.4579581618309021,2.1233697341240044e-27
64.0,-20.75,3993,1568222727,0.4579581618309021,2.1233697341240044e-27
64.0,-21.0,3696,1568222760,0.0008519634138792753,1.3146191853777008e-30
64.0,-21.0,3421,1568222793,0.0008519634138792753,1.3146191853777008e-30
64.0,-21.25,3299,1568222809,1.1040842196052836e-07,1.1251659833697976e-30
64.0,-21.25,3208,1568222821,1.1040842196052836e-07,1.1251659833697976e-30
64.0,-21.25,3147,1568222832,1.1040842196052836e-07,1.1251659833697976e-30
64.0,-21.25,3101,1568222844,1.1040842196052836e-07,1.1251659833697976e-30
64.0,-21.25,3071,1568222856,1.1040842196052836e-07,1.1251659833697976e-30
64.0,-21.25,3025,1568222868,1.1040842196052836e-07,1.1251659833697976e-30
64.0,-21.25,2903,1568222881,1.1040842196052836e-07,1.1251659833697976e-30
64.0,-21.25,2797,1568222893,1.1040842196052836e-07,1.1251659833697976e-30
64.0,-21.5,2705,1568222905,1.4437674389355948e-09,7.386102144352242e-31
64.0,-21.5,2598,1568222917,1.4437674389355948e-09,7.386102144352242e-31
64.0,-21.5,2484,1568222933,1.4437674389355948e-09,7.386102144352242e-31
64.0,-21.5,2400,1568222945,1.4437674389355948e-09,7.386102144352242e-31
64.0,-21.5,2332,1568222957,1.4437674389355948e-09,7.386102144352242e-31
64.0,-21.5,2271,1568222969,1.3819280442195492e-10,1.8580872751611112e-34
64.0,-21.5,2210,1568222981,1.3819280442195492e-10,1.8580872751611112e-34
64.0,-21.75,2149,1568222993,1.2925680491215896e-11,1.184632212278748e-34
64.0,-21.75,2088,1568223005,1.2925680491215896e-11,1.184632212278748e-34
64.0,-21.75,2027,1568223017,1.2925680491215896e-11,1.184632212278748e-34
64.0,-21.75,1966,1568223029,1.2925680491215896e-11,1.184632212278748e-34
64.0,-21.75,1913,1568223041,1.2925680491215896e-11,1.184632212278748e-34
64.0,-21.75,1852,1568223053,1.2925680491215896e-11,1.184632212278748e-34
64.0,-21.75,1798,1568223065,1.2925680491215896e-11,1.184632212278748e-34
64.0,-21.75,1737,1568223078,1.2925680491215896e-11,1.184632212278748e-34
64.0,-21.75,1676,1568223092,1.2925680491215896e-11,1.184632212278748e-34
64.0,-22.0,1615,1568223102,2.771359313910593e-12,1.3740840194891356e-34
64.0,-22.0,1577,1568223114,2.771359313910593e-12,1.3740840194891356e-34
64.0,-22.0,1539,1568223126,2.771359313910593e-12,1.3740840194891356e-34
64.0,-22.0,1509,1568223138,2.771359313910593e-12,1.3740840194891356e-34
64.0,-22.0,1494,1568223145,2.771359313910593e-12,1.3740840194891356e-34
64.0,-22.0,1471,1568223157,2.771359313910593e-12,1.3740840194891356e-34
64.0,-22.0,1455,1568223163,2.771359313910593e-12,1.3740840194891356e-34
64.0,-22.0,1433,1568223174,1.6228563631814907e-12,1.5371201497902684e-34
64.0,-22.0,1417,1568223180,1.6228563631814907e-12,1.5371201497902684e-34
64.0,-22.0,1410,1568223189,1.6228563631814907e-12,1.5371201497902684e-34
64.0,-22.0,1387,1568223199,1.6228563631814907e-12,1.5371201497902684e-34
64.0,-22.0,1372,1568223205,1.6228563631814907e-12,1.5371201497902684e-34
64.0,-22.0,1364,1568223211,1.6228563631814907e-12,1.5371201497902684e-34
64.0,-22.25,1364,1568223223,1.9695277852192772e-13,1.821408981556201e-34
64.0,-22.25,1356,1568223229,1.9695277852192772e-13,1.821408981556201e-34
64.0,-22.25,1341,1568223235,1.9695277852192772e-13,1.821408981556201e-34
64.0,-22.25,1318,1568223242,1.9695277852192772e-13,1.821408981556201e-34
64.0,-22.25,1196,1568223269,1.9695277852192772e-13,1.821408981556201e-34
64.0,-22.25,1166,1568223276,1.9695277852192772e-13,1.821408981556201e-34
64.0,-22.25,1105,1568223287,1.9695277852192772e-13,1.821408981556201e-34
64.0,-22.25,1074,1568223293,1.9695277852192772e-13,1.821408981556201e-34
64.0,-22.25,1044,1568223299,1.9695277852192772e-13,1.821408981556201e-34
64.0,-22.25,1013,1568223307,1.9695277852192772e-13,1.821408981556201e-34
64.0,-22.25,968,1568223317,1.9695277852192772e-13,1.821408981556201e-34
64.0,-22.25,953,1568223323,1.9695277852192772e-13,1.821408981556201e-34
64.0,-22.5,602,1568223410,0.0,0.0
64.0,-22.5,587,1568223416,0.0,0.0
64.0,-22.5,549,1568223426,0.0,0.0
64.0,-22.5,495,1568223443,0.0,0.0
64.0,-22.5,457,1568223453,0.0,0.0
64.0,-22.5,404,1568223469,0.0,0.0
64.0,-22.5,343,1568223485,0.0,0.0
64.0,-22.5,312,1568223496,0.0,0.0
64.0,-22.5,274,1568223506,0.0,0.0
64.0,-22.5,236,1568223516,0.0,0.0
64.0,-22.5,206,1568223526,0.0,0.0
64.0,-22.75,0,1568223590,0.0,0.0
64.0,-22.75,0,1568223596,0.0,0.0
64.0,-22.75,0,1568223602,0.0,0.0
64.0,-22.75,0,1568223609,0.0,0.0
64.0,-22.75,0,1568223617,0.0,0.0
64.0,-22.75,0,1568223623,0.0,0.0
64.0,-22.75,0,1568223629,0.0,0.0
64.0,-22.75,0,1568223635,0.0,0.0
64.0,-22.75,0,1568223642,0.0,0.0
64.0,-22.75,0,1568223651,0.0,0.0
64.0,-22.75,0,1568223660,0.0,0.0
64.0,-22.75,0,1568223669,0.0,0.0
64.0,-22.75,0,1568223675,0.0,0.0
64.0,-22.75,0,1568223687,0.0,0.0
64.0,-22.75,0,1568223693,0.0,0.0
64.0,-22.75,0,1568223706,0.0,0.0
64.0,-22.75,0,1568223714,0.0,0.0
64.0,-22.75,0,1568223723,0.0,0.0
64.0,-22.75,0,1568223729,0.0,0.0
64.0,-22.75,0,1568223735,0.0,0.0
64.0,-22.75,0,1568223742,0.0,0.0
64.0,-22.75,0,1568223750,0.0,0.0
64.0,-22.75,0,1568223756,0.0,0.0
64.0,-22.75,0,1568223763,0.0,0.0
64.0,-22.75,0,1568223775,0.0,0.0
64.0,-22.75,0,1568223784,0.0,0.0
64.0,-22.75,0,1568223790,0.0,0.0
64.0,-22.75,0,1568223796,0.0,0.0
64.0,-22.75,0,1568223803,0.0,0.0
64.0,-22.75,0,1568223811,0.0,0.0
64.0,-22.75,0,1568223818,0.0,0.0
64.0,-22.75,0,1568223824,0.0,0.0
