{
    "devices": [
        {
            "addr": "38a1",
            "discovery": "",
            "endpoints": [
                {
                    "clusters": [
                        {
                            "attributes": [
                                {
                                    "attribute": 0,
                                    "data": 2132,
                                    "name": "temperature",
                                    "type": "float",
                                    "unit": "\u00b0C",
                                    "value": 21.32
                                }
                            ],
                            "cluster": 1026
                        },
                        {
                            "attributes": [
                                {
                                    "attribute": 0,
                                    "data": 4358,
                                    "name": "humidity",
                                    "type": "float",
                                    "unit": "%",
                                    "value": 43.58
                                }
                            ],
                            "cluster": 1029
                        },
                        {
                            "attributes": [
                                {
                                    "attribute": 0,
                                    "data": 1030,
                                    "name": "pressure",
                                    "type": "int",
                                    "unit": "mb",
                                    "value": 1030
                                },
                                {
                                    "attribute": 20,
                                    "data": -1
                                },
                                {
                                    "attribute": 16,
                                    "data": 10309,
                                    "name": "pressure2",
                                    "type": "float",
                                    "unit": "mb",
                                    "value": 1030.9
                                }
                            ],
                            "cluster": 1027
                        },
                        {
                            "attributes": [
                                {
                                    "attribute": 65281,
                                    "data": "01219f0b0421a843052105000624010000000064295b0865212b11662bce9201000a210000",
                                    "name": "battery_voltage",
                                    "type": "float",
                                    "unit": "V",
                                    "value": 2.975
                                }
                            ],
                            "cluster": 0
                        }
                    ],
                    "device": 0,
                    "endpoint": 1,
                    "in_clusters": [],
                    "out_clusters": [],
                    "profile": 0
                }
            ],
            "generictype": "",
            "info": {
                "addr": "38a1",
                "id": 0,
                "ieee": "00158d00025f1d53",
                "last_seen": "2019-03-26 17:50:49",
                "lqi": 128,
                "power_type": 0
            }
        },
        {
            "addr": "d383",
            "discovery": "",
            "endpoints": [
                {
                    "clusters": [
                        {
                            "attributes": [
                                {
                                    "attribute": 0,
                                    "data": 2237,
                                    "name": "temperature",
                                    "type": "float",
                                    "unit": "\u00b0C",
                                    "value": 22.37
                                }
                            ],
                            "cluster": 1026
                        },
                        {
                            "attributes": [
                                {
                                    "attribute": 0,
                                    "data": 4724,
                                    "name": "humidity",
                                    "type": "float",
                                    "unit": "%",
                                    "value": 47.24
                                }
                            ],
                            "cluster": 1029
                        },
                        {
                            "attributes": [
                                {
                                    "attribute": 0,
                                    "data": 1030,
                                    "name": "pressure",
                                    "type": "int",
                                    "unit": "mb",
                                    "value": 1030
                                },
                                {
                                    "attribute": 20,
                                    "data": -1
                                },
                                {
                                    "attribute": 16,
                                    "data": 10308,
                                    "name": "pressure2",
                                    "type": "float",
                                    "unit": "mb",
                                    "value": 1030.8
                                }
                            ],
                            "cluster": 1027
                        },
                        {
                            "attributes": [
                                {
                                    "attribute": 65281,
                                    "data": "0121b30b0421a84305211000062401000000006429ba0865218612662bb89201000a210000",
                                    "name": "battery_voltage",
                                    "type": "float",
                                    "unit": "V",
                                    "value": 2.995
                                }
                            ],
                            "cluster": 0
                        }
                    ],
                    "device": 0,
                    "endpoint": 1,
                    "in_clusters": [],
                    "out_clusters": [],
                    "profile": 0
                }
            ],
            "generictype": "",
            "info": {
                "addr": "d383",
                "id": 1,
                "ieee": "00158d0002c8ceaa",
                "last_seen": "2019-03-26 17:45:15",
                "lqi": 145,
                "mac_capability": "10000000",
                "power_type": 0
            }
        },
        {
            "addr": "91ed",
            "discovery": "auto-discovered",
            "endpoints": [
                {
                    "clusters": [
                        {
                            "attributes": [
                                {
                                    "attribute": 5,
                                    "data": "lumi.ctrl_neutral2",
                                    "name": "type",
                                    "type": "str",
                                    "value": "lumi.ctrl_neutral2"
                                },
                                {
                                    "attribute": 1,
                                    "data": 22,
                                    "name": "application_version",
                                    "value": 22
                                }
                            ],
                            "cluster": 0
                        }
                    ],
                    "device": 6,
                    "endpoint": 1,
                    "in_clusters": [
                        0,
                        3,
                        1,
                        2,
                        25,
                        10
                    ],
                    "out_clusters": [
                        0,
                        10,
                        25
                    ],
                    "profile": 260
                },
                {
                    "clusters": [
                        {
                            "attributes": [
                                {
                                    "attribute": 0,
                                    "data": false,
                                    "name": "onoff",
                                    "type": "bool",
                                    "value": false
                                },
                                {
                                    "attribute": 61440,
                                    "data": 117440562
                                }
                            ],
                            "cluster": 6
                        }
                    ],
                    "device": 256,
                    "endpoint": 2,
                    "in_clusters": [
                        16,
                        6,
                        4,
                        5
                    ],
                    "out_clusters": [],
                    "profile": 260
                },
                {
                    "clusters": [
                        {
                            "attributes": [
                                {
                                    "attribute": 0,
                                    "data": false,
                                    "name": "onoff3",
                                    "type": "bool",
                                    "value": false
                                },
                                {
                                    "attribute": 61440,
                                    "data": 117440742
                                }
                            ],
                            "cluster": 6
                        }
                    ],
                    "device": 256,
                    "endpoint": 3,
                    "in_clusters": [
                        16,
                        6,
                        4,
                        5
                    ],
                    "out_clusters": [],
                    "profile": 260
                },
                {
                    "clusters": [],
                    "device": 83,
                    "endpoint": 8,
                    "in_clusters": [
                        12
                    ],
                    "out_clusters": [],
                    "profile": 260
                },
                {
                    "clusters": [
                        {
                            "attributes": [
                                {
                                    "attribute": 0,
                                    "data": false,
                                    "name": "onoff5",
                                    "type": "bool",
                                    "value": false
                                }
                            ],
                            "cluster": 6
                        }
                    ],
                    "device": 0,
                    "endpoint": 5,
                    "in_clusters": [],
                    "out_clusters": [],
                    "profile": 0
                },
                {
                    "clusters": [
                        {
                            "attributes": [
                                {
                                    "attribute": 0,
                                    "data": false,
                                    "name": "onoff4",
                                    "type": "bool",
                                    "value": false
                                }
                            ],
                            "cluster": 6
                        }
                    ],
                    "device": 0,
                    "endpoint": 4,
                    "in_clusters": [],
                    "out_clusters": [],
                    "profile": 0
                }
            ],
            "generictype": "",
            "info": {
                "addr": "91ed",
                "assumed_state": true,
                "id": 2,
                "ieee": "00158d0003150474",
                "last_seen": "2019-03-26 18:19:03",
                "lqi": 153,
                "mac_capability": "10000100",
                "power_type": 1
            }
        },
        {
            "addr": "cab4",
            "discovery": "auto-discovered",
            "endpoints": [
                {
                    "clusters": [
                        {
                            "attributes": [
                                {
                                    "attribute": 5,
                                    "data": "TRADFRI bulb E27 CWS opal 600lm",
                                    "name": "type",
                                    "type": "str",
                                    "value": "TRADFRI bulb E27 CWS opal 600lm"
                                }
                            ],
                            "cluster": 0
                        },
                        {
                            "attributes": [
                                {
                                    "attribute": 0,
                                    "data": 198,
                                    "name": "current_level",
                                    "type": "int",
                                    "value": 77
                                }
                            ],
                            "cluster": 8
                        },
                        {
                            "attributes": [
                                {
                                    "attribute": 0,
                                    "data": false,
                                    "name": "onoff",
                                    "type": "bool",
                                    "value": false
                                }
                            ],
                            "cluster": 6
                        }
                    ],
                    "device": 512,
                    "endpoint": 1,
                    "in_clusters": [
                        0,
                        3,
                        4,
                        5,
                        6,
                        8,
                        768,
                        2821,
                        4096
                    ],
                    "out_clusters": [
                        5,
                        25,
                        32,
                        4096
                    ],
                    "profile": 49246
                }
            ],
            "generictype": "",
            "info": {
                "addr": "cab4",
                "id": 50,
                "ieee": "d0cf5efffe05324e",
                "last_seen": "2019-02-05 18:34:55",
                "lqi": 60,
                "mac_capability": "10001110",
                "power_type": 1
            }
        },
        {
            "addr": "6bb2",
            "discovery": "auto-discovered",
            "endpoints": [
                {
                    "clusters": [
                        {
                            "attributes": [
                                {
                                    "attribute": 5,
                                    "data": "TRADFRI remote control",
                                    "name": "type",
                                    "type": "str",
                                    "value": "TRADFRI remote control"
                                }
                            ],
                            "cluster": 0
                        },
                        {
                            "attributes": [
                                {
                                    "attribute": 32,
                                    "data": 27,
                                    "name": "battery_voltage",
                                    "type": "float",
                                    "value": 2.7
                                }
                            ],
                            "cluster": 1
                        }
                    ],
                    "device": 2096,
                    "endpoint": 1,
                    "in_clusters": [
                        0,
                        1,
                        3,
                        9,
                        2821,
                        4096
                    ],
                    "out_clusters": [
                        3,
                        4,
                        5,
                        6,
                        8,
                        25,
                        4096
                    ],
                    "profile": 49246
                }
            ],
            "generictype": "",
            "info": {
                "addr": "6bb2",
                "id": 11,
                "ieee": "000d6ffffe1f8c80",
                "last_seen": "2019-02-05 18:35:44",
                "lqi": 99,
                "mac_capability": "10000000",
                "power_type": 0
            }
        },
        {
            "addr": "ea09",
            "discovery": "templated",
            "endpoints": [
                {
                    "clusters": [
                        {
                            "attributes": [
                                {
                                    "attribute": 5,
                                    "data": "lumi.sensor_switch.aq2",
                                    "name": "type",
                                    "type": "str",
                                    "value": "lumi.sensor_switch.aq2"
                                },
                                {
                                    "attribute": 1,
                                    "data": 3,
                                    "name": "application_version",
                                    "value": 3
                                },
                                {
                                    "attribute": 4,
                                    "data": "LUMI",
                                    "name": "manufacturer",
                                    "value": "LUMI"
                                },
                                {
                                    "attribute": 65281,
                                    "data": "0121d10b03281a0421a81305212a04062401000000000a210000",
                                    "name": "battery_voltage",
                                    "type": "float",
                                    "unit": "V",
                                    "value": 3.025
                                }
                            ],
                            "cluster": 0
                        },
                        {
                            "attributes": [
                                {
                                    "attribute": 0,
                                    "data": true,
                                    "inverse": true,
                                    "name": "onoff",
                                    "type": "bool",
                                    "value": false
                                },
                                {
                                    "attribute": 32768,
                                    "data": 0,
                                    "expire": 2,
                                    "name": "multiclick",
                                    "type": "int",
                                    "value": 0
                                }
                            ],
                            "cluster": 6
                        }
                    ],
                    "device": 24321,
                    "endpoint": 1,
                    "in_clusters": [
                        0,
                        65535,
                        6
                    ],
                    "out_clusters": [
                        0,
                        4,
                        65535
                    ],
                    "profile": 260
                }
            ],
            "generictype": "sensor",
            "info": {
                "addr": "ea09",
                "bit_field": "0100000000000010",
                "descriptor_capability": "00000000",
                "id": 11,
                "ieee": "00158d0002042c22",
                "last_seen": "2019-03-13 13:12:40",
                "lqi": 189,
                "mac_capability": "10000000",
                "manufacturer_code": "1037",
                "power_type": 0,
                "server_mask": 0
            }
        },
        {
            "addr": "91ad",
            "discovery": "auto-discovered",
            "endpoints": [
                {
                    "clusters": [
                        {
                            "attributes": [
                                {
                                    "attribute": 5,
                                    "data": "TRADFRI control outlet",
                                    "name": "type",
                                    "type": "str",
                                    "value": "TRADFRI control outlet"
                                }
                            ],
                            "cluster": 0
                        }
                    ],
                    "device": 266,
                    "endpoint": 1,
                    "in_clusters": [
                        0,
                        3,
                        4,
                        5,
                        6,
                        8,
                        64636
                    ],
                    "out_clusters": [
                        5,
                        25,
                        32
                    ],
                    "profile": 260
                },
                {
                    "clusters": [],
                    "device": 16,
                    "endpoint": 2,
                    "in_clusters": [
                        4096
                    ],
                    "out_clusters": [
                        4096
                    ],
                    "profile": 49246
                },
                {
                    "clusters": [],
                    "device": 97,
                    "endpoint": 242,
                    "in_clusters": [
                        33
                    ],
                    "out_clusters": [
                        33
                    ],
                    "profile": 41440
                }
            ],
            "generictype": "",
            "info": {
                "addr": "91ad",
                "id": 12,
                "ieee": "000d6ffffe106f35",
                "last_seen": "2019-02-27 14:13:16",
                "lqi": 140,
                "mac_capability": "10001110",
                "power_type": 1
            }
        },
        {
            "addr": "bd3c",
            "discovery": "templated",
            "endpoints": [
                {
                    "clusters": [
                        {
                            "attributes": [
                                {
                                    "attribute": 0,
                                    "data": 2316,
                                    "name": "temperature",
                                    "type": "float",
                                    "unit": "\u00b0C",
                                    "value": 23.16
                                }
                            ],
                            "cluster": 1026
                        },
                        {
                            "attributes": [
                                {
                                    "attribute": 0,
                                    "data": 3915,
                                    "name": "humidity",
                                    "type": "float",
                                    "unit": "%",
                                    "value": 39.15
                                }
                            ],
                            "cluster": 1029
                        },
                        {
                            "attributes": [
                                {
                                    "attribute": 0,
                                    "data": 1030,
                                    "name": "pressure",
                                    "type": "int",
                                    "unit": "mb",
                                    "value": 1030
                                },
                                {
                                    "attribute": 20,
                                    "data": -1
                                },
                                {
                                    "attribute": 16,
                                    "data": 10309,
                                    "name": "pressure2",
                                    "type": "float",
                                    "unit": "mb",
                                    "value": 1030.9
                                }
                            ],
                            "cluster": 1027
                        },
                        {
                            "attributes": [
                                {
                                    "attribute": 65281,
                                    "data": "0121a90b0421a81305210b000624010000000064290a096521510f662bc09201000a210000",
                                    "name": "battery_voltage",
                                    "type": "float",
                                    "unit": "V",
                                    "value": 2.985
                                },
                                {
                                    "attribute": 5,
                                    "data": "lumi.weather",
                                    "name": "type",
                                    "type": "str",
                                    "value": "lumi.weather"
                                },
                                {
                                    "attribute": 1,
                                    "data": 3,
                                    "name": "application_version",
                                    "value": 3
                                },
                                {
                                    "attribute": 4,
                                    "data": "LUMI",
                                    "name": "manufacturer",
                                    "value": "LUMI"
                                },
                                {
                                    "attribute": 7,
                                    "data": 3,
                                    "name": "power_source",
                                    "value": 3
                                }
                            ],
                            "cluster": 0
                        }
                    ],
                    "device": 24321,
                    "endpoint": 1,
                    "in_clusters": [
                        0,
                        3,
                        65535,
                        1026,
                        1027,
                        1029
                    ],
                    "out_clusters": [
                        0,
                        4,
                        65535
                    ],
                    "profile": 260
                }
            ],
            "generictype": "sensor",
            "info": {
                "addr": "bd3c",
                "bit_field": "0100000000000010",
                "descriptor_capability": "00000000",
                "id": 3,
                "ieee": "00158d0002c8cf4f",
                "last_seen": "2019-03-26 18:17:00",
                "lqi": 108,
                "mac_capability": "10000000",
                "manufacturer_code": "1037",
                "power_type": 0,
                "server_mask": 0
            }
        },
        {
            "addr": "45ac",
            "discovery": "templated",
            "endpoints": [
                {
                    "clusters": [
                        {
                            "attributes": [
                                {
                                    "attribute": 0,
                                    "data": 2003,
                                    "name": "temperature",
                                    "type": "float",
                                    "unit": "\u00b0C",
                                    "value": 20.03
                                }
                            ],
                            "cluster": 1026
                        },
                        {
                            "attributes": [
                                {
                                    "attribute": 0,
                                    "data": 5139,
                                    "name": "humidity",
                                    "type": "float",
                                    "unit": "%",
                                    "value": 51.39
                                }
                            ],
                            "cluster": 1029
                        },
                        {
                            "attributes": [
                                {
                                    "attribute": 0,
                                    "data": 1031,
                                    "name": "pressure",
                                    "type": "int",
                                    "unit": "mb",
                                    "value": 1031
                                },
                                {
                                    "attribute": 20,
                                    "data": -1
                                },
                                {
                                    "attribute": 16,
                                    "data": 10312,
                                    "name": "pressure2",
                                    "type": "float",
                                    "unit": "mb",
                                    "value": 1031.2
                                }
                            ],
                            "cluster": 1027
                        },
                        {
                            "attributes": [
                                {
                                    "attribute": 65281,
                                    "data": "01219f0b0421a81305210b00062401000000006429cc0765212d14662bcf9201000a210000",
                                    "name": "battery_voltage",
                                    "type": "float",
                                    "unit": "V",
                                    "value": 2.975
                                },
                                {
                                    "attribute": 5,
                                    "data": "lumi.weather",
                                    "name": "type",
                                    "type": "str",
                                    "value": "lumi.weather"
                                },
                                {
                                    "attribute": 4,
                                    "data": "LUMI",
                                    "name": "manufacturer",
                                    "value": "LUMI"
                                },
                                {
                                    "attribute": 7,
                                    "data": 3,
                                    "name": "power_source",
                                    "value": 3
                                },
                                {
                                    "attribute": 1,
                                    "data": 3,
                                    "name": "application_version",
                                    "value": 3
                                }
                            ],
                            "cluster": 0
                        }
                    ],
                    "device": 24321,
                    "endpoint": 1,
                    "in_clusters": [
                        0,
                        3,
                        65535,
                        1026,
                        1027,
                        1029
                    ],
                    "out_clusters": [
                        0,
                        4,
                        65535
                    ],
                    "profile": 260
                }
            ],
            "generictype": "sensor",
            "info": {
                "addr": "45ac",
                "bit_field": "0100000000000010",
                "descriptor_capability": "00000000",
                "id": 5,
                "ieee": "00158d0002c8cec5",
                "last_seen": "2019-03-26 18:10:40",
                "lqi": 99,
                "mac_capability": "10000000",
                "manufacturer_code": "1037",
                "power_type": 0,
                "server_mask": 0
            }
        },
        {
            "addr": "6c18",
            "discovery": "templated",
            "endpoints": [
                {
                    "clusters": [
                        {
                            "attributes": [
                                {
                                    "attribute": 65281,
                                    "data": "01219f0b0421a81305210900062401000000006429370765212f15662bb29201000a210000",
                                    "name": "battery_voltage",
                                    "type": "float",
                                    "unit": "V",
                                    "value": 2.975
                                },
                                {
                                    "attribute": 5,
                                    "data": "lumi.weather",
                                    "name": "type",
                                    "type": "str",
                                    "value": "lumi.weather"
                                },
                                {
                                    "attribute": 4,
                                    "data": "LUMI",
                                    "name": "manufacturer",
                                    "value": "LUMI"
                                },
                                {
                                    "attribute": 7,
                                    "data": 3,
                                    "name": "power_source",
                                    "value": 3
                                },
                                {
                                    "attribute": 1,
                                    "data": 3,
                                    "name": "application_version",
                                    "value": 3
                                }
                            ],
                            "cluster": 0
                        },
                        {
                            "attributes": [
                                {
                                    "attribute": 0,
                                    "data": 1843,
                                    "name": "temperature",
                                    "type": "float",
                                    "unit": "\u00b0C",
                                    "value": 18.43
                                }
                            ],
                            "cluster": 1026
                        },
                        {
                            "attributes": [
                                {
                                    "attribute": 0,
                                    "data": 5376,
                                    "name": "humidity",
                                    "type": "float",
                                    "unit": "%",
                                    "value": 53.76
                                }
                            ],
                            "cluster": 1029
                        },
                        {
                            "attributes": [
                                {
                                    "attribute": 0,
                                    "data": 1030,
                                    "name": "pressure",
                                    "type": "int",
                                    "unit": "mb",
                                    "value": 1030
                                },
                                {
                                    "attribute": 20,
                                    "data": -1
                                },
                                {
                                    "attribute": 16,
                                    "data": 10308,
                                    "name": "pressure2",
                                    "type": "float",
                                    "unit": "mb",
                                    "value": 1030.8
                                }
                            ],
                            "cluster": 1027
                        }
                    ],
                    "device": 24321,
                    "endpoint": 1,
                    "in_clusters": [
                        0,
                        3,
                        65535,
                        1026,
                        1027,
                        1029
                    ],
                    "out_clusters": [
                        0,
                        4,
                        65535
                    ],
                    "profile": 260
                }
            ],
            "generictype": "sensor",
            "info": {
                "addr": "6c18",
                "bit_field": "0100000000000010",
                "descriptor_capability": "00000000",
                "id": 6,
                "ieee": "00158d00025d8df2",
                "last_seen": "2019-03-26 17:44:21",
                "lqi": 100,
                "mac_capability": "10000000",
                "manufacturer_code": "1037",
                "power_type": 0,
                "server_mask": 0
            }
        },
        {
            "addr": "baff",
            "discovery": "templated",
            "endpoints": [
                {
                    "clusters": [
                        {
                            "attributes": [
                                {
                                    "attribute": 0,
                                    "data": 1846,
                                    "name": "temperature",
                                    "type": "float",
                                    "unit": "\u00b0C",
                                    "value": 18.46
                                }
                            ],
                            "cluster": 1026
                        },
                        {
                            "attributes": [
                                {
                                    "attribute": 0,
                                    "data": 5328,
                                    "name": "humidity",
                                    "type": "float",
                                    "unit": "%",
                                    "value": 53.28
                                }
                            ],
                            "cluster": 1029
                        },
                        {
                            "attributes": [
                                {
                                    "attribute": 0,
                                    "data": 1030,
                                    "name": "pressure",
                                    "type": "int",
                                    "unit": "mb",
                                    "value": 1030
                                },
                                {
                                    "attribute": 20,
                                    "data": -1
                                },
                                {
                                    "attribute": 16,
                                    "data": 10307,
                                    "name": "pressure2",
                                    "type": "float",
                                    "unit": "mb",
                                    "value": 1030.7
                                }
                            ],
                            "cluster": 1027
                        },
                        {
                            "attributes": [
                                {
                                    "attribute": 65281,
                                    "data": "01219f0b0421a81305210a0006240100000000642934076521db14662bb09201000a210000",
                                    "name": "battery_voltage",
                                    "type": "float",
                                    "unit": "V",
                                    "value": 2.975
                                },
                                {
                                    "attribute": 5,
                                    "data": "lumi.weather",
                                    "name": "type",
                                    "type": "str",
                                    "value": "lumi.weather"
                                },
                                {
                                    "attribute": 1,
                                    "data": 3,
                                    "name": "application_version",
                                    "value": 3
                                },
                                {
                                    "attribute": 4,
                                    "data": "LUMI",
                                    "name": "manufacturer",
                                    "value": "LUMI"
                                },
                                {
                                    "attribute": 7,
                                    "data": 3,
                                    "name": "power_source",
                                    "value": 3
                                }
                            ],
                            "cluster": 0
                        }
                    ],
                    "device": 24321,
                    "endpoint": 1,
                    "in_clusters": [
                        0,
                        3,
                        65535,
                        1026,
                        1027,
                        1029
                    ],
                    "out_clusters": [
                        0,
                        4,
                        65535
                    ],
                    "profile": 260
                }
            ],
            "generictype": "sensor",
            "info": {
                "addr": "baff",
                "bit_field": "0100000000000010",
                "descriptor_capability": "00000000",
                "id": 7,
                "ieee": "00158d00025efeb6",
                "last_seen": "2019-03-26 18:14:47",
                "lqi": 108,
                "mac_capability": "10000000",
                "manufacturer_code": "1037",
                "power_type": 0,
                "server_mask": 0
            }
        },
        {
            "addr": "6067",
            "discovery": "templated",
            "endpoints": [
                {
                    "clusters": [
                        {
                            "attributes": [
                                {
                                    "attribute": 5,
                                    "data": "lumi.weather",
                                    "name": "type",
                                    "type": "str",
                                    "value": "lumi.weather"
                                },
                                {
                                    "attribute": 4,
                                    "data": "LUMI",
                                    "name": "manufacturer",
                                    "value": "LUMI"
                                },
                                {
                                    "attribute": 7,
                                    "data": 3,
                                    "name": "power_source",
                                    "value": 3
                                },
                                {
                                    "attribute": 1,
                                    "data": 3,
                                    "name": "application_version",
                                    "value": 3
                                },
                                {
                                    "attribute": 65281,
                                    "data": "01219f0b0421a81305210900062401000000006429bd086521c711662bfc9201000a210000",
                                    "name": "battery_voltage",
                                    "type": "float",
                                    "unit": "V",
                                    "value": 2.975
                                }
                            ],
                            "cluster": 0
                        },
                        {
                            "attributes": [
                                {
                                    "attribute": 0,
                                    "data": 2233,
                                    "name": "temperature",
                                    "type": "float",
                                    "unit": "\u00b0C",
                                    "value": 22.33
                                }
                            ],
                            "cluster": 1026
                        },
                        {
                            "attributes": [
                                {
                                    "attribute": 0,
                                    "data": 1031,
                                    "name": "pressure",
                                    "type": "int",
                                    "unit": "mb",
                                    "value": 1031
                                },
                                {
                                    "attribute": 16,
                                    "data": 10314,
                                    "name": "pressure2",
                                    "type": "float",
                                    "unit": "mb",
                                    "value": 1031.4
                                },
                                {
                                    "attribute": 20,
                                    "data": -1
                                }
                            ],
                            "cluster": 1027
                        },
                        {
                            "attributes": [
                                {
                                    "attribute": 0,
                                    "data": 4547,
                                    "name": "humidity",
                                    "type": "float",
                                    "unit": "%",
                                    "value": 45.47
                                }
                            ],
                            "cluster": 1029
                        }
                    ],
                    "device": 24321,
                    "endpoint": 1,
                    "in_clusters": [
                        0,
                        3,
                        65535,
                        1026,
                        1027,
                        1029
                    ],
                    "out_clusters": [
                        0,
                        4,
                        65535
                    ],
                    "profile": 260
                }
            ],
            "generictype": "sensor",
            "info": {
                "addr": "6067",
                "bit_field": "0100000000000010",
                "descriptor_capability": "00000000",
                "id": 8,
                "ieee": "00158d00025efb69",
                "last_seen": "2019-03-26 18:01:29",
                "lqi": 103,
                "mac_capability": "10000000",
                "manufacturer_code": "1037",
                "power_type": 0,
                "server_mask": 0
            }
        },
        {
            "addr": "4f0d",
            "discovery": "templated",
            "endpoints": [
                {
                    "clusters": [
                        {
                            "attributes": [
                                {
                                    "attribute": 0,
                                    "data": 2170,
                                    "name": "temperature",
                                    "type": "float",
                                    "unit": "\u00b0C",
                                    "value": 21.7
                                }
                            ],
                            "cluster": 1026
                        },
                        {
                            "attributes": [
                                {
                                    "attribute": 0,
                                    "data": 4635,
                                    "name": "humidity",
                                    "type": "float",
                                    "unit": "%",
                                    "value": 46.35
                                }
                            ],
                            "cluster": 1029
                        },
                        {
                            "attributes": [
                                {
                                    "attribute": 0,
                                    "data": 1030,
                                    "name": "pressure",
                                    "type": "int",
                                    "unit": "mb",
                                    "value": 1030
                                },
                                {
                                    "attribute": 20,
                                    "data": -1
                                },
                                {
                                    "attribute": 16,
                                    "data": 10307,
                                    "name": "pressure2",
                                    "type": "float",
                                    "unit": "mb",
                                    "value": 1030.7
                                }
                            ],
                            "cluster": 1027
                        },
                        {
                            "attributes": [
                                {
                                    "attribute": 65281,
                                    "data": "0121950b0421a843052109000624010000000064297a0865211712662bb49201000a210000",
                                    "name": "battery_voltage",
                                    "type": "float",
                                    "unit": "V",
                                    "value": 2.965
                                },
                                {
                                    "attribute": 5,
                                    "data": "lumi.weather",
                                    "name": "type",
                                    "type": "str",
                                    "value": "lumi.weather"
                                },
                                {
                                    "attribute": 4,
                                    "data": "LUMI",
                                    "name": "manufacturer",
                                    "value": "LUMI"
                                },
                                {
                                    "attribute": 7,
                                    "data": 3,
                                    "name": "power_source",
                                    "value": 3
                                },
                                {
                                    "attribute": 1,
                                    "data": 3,
                                    "name": "application_version",
                                    "value": 3
                                }
                            ],
                            "cluster": 0
                        }
                    ],
                    "device": 24321,
                    "endpoint": 1,
                    "in_clusters": [
                        0,
                        3,
                        65535,
                        1026,
                        1027,
                        1029
                    ],
                    "out_clusters": [
                        0,
                        4,
                        65535
                    ],
                    "profile": 260
                }
            ],
            "generictype": "sensor",
            "info": {
                "addr": "4f0d",
                "bit_field": "0100000000000010",
                "descriptor_capability": "00000000",
                "id": 9,
                "ieee": "00158d00025c02da",
                "last_seen": "2019-03-26 17:33:38",
                "lqi": 51,
                "mac_capability": "10000000",
                "manufacturer_code": "1037",
                "power_type": 0,
                "server_mask": 0
            }
        },
        {
            "addr": "8213",
            "discovery": "templated",
            "endpoints": [
                {
                    "clusters": [
                        {
                            "attributes": [
                                {
                                    "attribute": 0,
                                    "data": 2112,
                                    "name": "temperature",
                                    "type": "float",
                                    "unit": "\u00b0C",
                                    "value": 21.12
                                }
                            ],
                            "cluster": 1026
                        },
                        {
                            "attributes": [
                                {
                                    "attribute": 0,
                                    "data": 4773,
                                    "name": "humidity",
                                    "type": "float",
                                    "unit": "%",
                                    "value": 47.73
                                }
                            ],
                            "cluster": 1029
                        },
                        {
                            "attributes": [
                                {
                                    "attribute": 0,
                                    "data": 1030,
                                    "name": "pressure",
                                    "type": "int",
                                    "unit": "mb",
                                    "value": 1030
                                },
                                {
                                    "attribute": 20,
                                    "data": -1
                                },
                                {
                                    "attribute": 16,
                                    "data": 10309,
                                    "name": "pressure2",
                                    "type": "float",
                                    "unit": "mb",
                                    "value": 1030.9
                                }
                            ],
                            "cluster": 1027
                        },
                        {
                            "attributes": [
                                {
                                    "attribute": 65281,
                                    "data": "01218b0b0421a81305210a0006240100000000642939086521b212662bb39201000a210000",
                                    "name": "battery_voltage",
                                    "type": "float",
                                    "unit": "V",
                                    "value": 2.955
                                },
                                {
                                    "attribute": 5,
                                    "data": "lumi.weather",
                                    "name": "type",
                                    "type": "str",
                                    "value": "lumi.weather"
                                },
                                {
                                    "attribute": 4,
                                    "data": "LUMI",
                                    "name": "manufacturer",
                                    "value": "LUMI"
                                },
                                {
                                    "attribute": 7,
                                    "data": 3,
                                    "name": "power_source",
                                    "value": 3
                                },
                                {
                                    "attribute": 1,
                                    "data": 3,
                                    "name": "application_version",
                                    "value": 3
                                }
                            ],
                            "cluster": 0
                        }
                    ],
                    "device": 24321,
                    "endpoint": 1,
                    "in_clusters": [
                        0,
                        3,
                        65535,
                        1026,
                        1027,
                        1029
                    ],
                    "out_clusters": [
                        0,
                        4,
                        65535
                    ],
                    "profile": 260
                }
            ],
            "generictype": "sensor",
            "info": {
                "addr": "8213",
                "bit_field": "0100000000000010",
                "descriptor_capability": "00000000",
                "id": 10,
                "ieee": "00158d0002c8ce19",
                "last_seen": "2019-03-26 17:51:01",
                "lqi": 92,
                "mac_capability": "10000000",
                "manufacturer_code": "1037",
                "power_type": 0,
                "server_mask": 0
            }
        },
        {
            "addr": "ecaf",
            "discovery": "templated",
            "endpoints": [
                {
                    "clusters": [
                        {
                            "attributes": [
                                {
                                    "attribute": 5,
                                    "data": "lumi.weather",
                                    "name": "type",
                                    "type": "str",
                                    "value": "lumi.weather"
                                },
                                {
                                    "attribute": 4,
                                    "data": "LUMI",
                                    "name": "manufacturer",
                                    "value": "LUMI"
                                },
                                {
                                    "attribute": 7,
                                    "data": 3,
                                    "name": "power_source",
                                    "value": 3
                                },
                                {
                                    "attribute": 1,
                                    "data": 3,
                                    "name": "application_version",
                                    "value": 3
                                },
                                {
                                    "attribute": 65281,
                                    "data": "01219f0b0421a81305210e00062401000000006429c4086521b510662be49201000a210000",
                                    "name": "battery_voltage",
                                    "type": "float",
                                    "unit": "V",
                                    "value": 2.975
                                }
                            ],
                            "cluster": 0
                        },
                        {
                            "attributes": [
                                {
                                    "attribute": 0,
                                    "data": 2239,
                                    "name": "temperature",
                                    "type": "float",
                                    "unit": "\u00b0C",
                                    "value": 22.39
                                }
                            ],
                            "cluster": 1026
                        },
                        {
                            "attributes": [
                                {
                                    "attribute": 0,
                                    "data": 1031,
                                    "name": "pressure",
                                    "type": "int",
                                    "unit": "mb",
                                    "value": 1031
                                },
                                {
                                    "attribute": 16,
                                    "data": 10312,
                                    "name": "pressure2",
                                    "type": "float",
                                    "unit": "mb",
                                    "value": 1031.2
                                },
                                {
                                    "attribute": 20,
                                    "data": -1
                                }
                            ],
                            "cluster": 1027
                        },
                        {
                            "attributes": [
                                {
                                    "attribute": 0,
                                    "data": 4266,
                                    "name": "humidity",
                                    "type": "float",
                                    "unit": "%",
                                    "value": 42.66
                                }
                            ],
                            "cluster": 1029
                        }
                    ],
                    "device": 24321,
                    "endpoint": 1,
                    "in_clusters": [
                        0,
                        3,
                        65535,
                        1026,
                        1027,
                        1029
                    ],
                    "out_clusters": [
                        0,
                        4,
                        65535
                    ],
                    "profile": 260
                }
            ],
            "generictype": "sensor",
            "info": {
                "addr": "ecaf",
                "bit_field": "0100000000000010",
                "descriptor_capability": "00000000",
                "id": 4,
                "ieee": "00158d00025d8dd9",
                "last_seen": "2019-03-26 17:48:14",
                "lqi": 151,
                "mac_capability": "10000000",
                "manufacturer_code": "1037",
                "power_type": 0,
                "server_mask": 0
            }
        },
        {
            "addr": "8121",
            "discovery": "templated",
            "endpoints": [
                {
                    "clusters": [
                        {
                            "attributes": [
                                {
                                    "attribute": 0,
                                    "data": 194,
                                    "name": "luminosity",
                                    "unit": "lm",
                                    "value": 194
                                }
                            ],
                            "cluster": 1024
                        },
                        {
                            "attributes": [
                                {
                                    "attribute": 0,
                                    "data": false,
                                    "expire": 10,
                                    "name": "presence",
                                    "type": "bool",
                                    "value": false
                                }
                            ],
                            "cluster": 1030
                        },
                        {
                            "attributes": [
                                {
                                    "attribute": 65281,
                                    "data": "0121d10b0328210421a81305211b00062404000000000a2100006410000b21e803",
                                    "name": "battery_voltage",
                                    "type": "float",
                                    "unit": "V",
                                    "value": 3.025
                                },
                                {
                                    "attribute": 5,
                                    "data": "lumi.sensor_motion.aq2",
                                    "name": "type",
                                    "type": "str",
                                    "value": "lumi.sensor_motion.aq2"
                                },
                                {
                                    "attribute": 4,
                                    "data": "LUMI",
                                    "name": "manufacturer",
                                    "value": "LUMI"
                                },
                                {
                                    "attribute": 7,
                                    "data": 3,
                                    "name": "power_source",
                                    "value": 3
                                },
                                {
                                    "attribute": 1,
                                    "data": 5,
                                    "name": "application_version",
                                    "value": 5
                                }
                            ],
                            "cluster": 0
                        }
                    ],
                    "device": 263,
                    "endpoint": 1,
                    "in_clusters": [
                        0,
                        65535,
                        1030,
                        1024,
                        1280,
                        1,
                        3
                    ],
                    "out_clusters": [
                        0,
                        25
                    ],
                    "profile": 260
                }
            ],
            "generictype": "sensor",
            "info": {
                "addr": "8121",
                "bit_field": "0100000000000010",
                "descriptor_capability": "00000000",
                "id": 11,
                "ieee": "00158d0002b5d38b",
                "last_seen": "2019-03-26 18:18:16",
                "lqi": 123,
                "mac_capability": "10000000",
                "manufacturer_code": 4151,
                "power_type": 0,
                "server_mask": 0
            }
        }
    ],
    "groups": {},
    "scenes": {}
}