{
  "shell_port": 55807,
  "iopub_port": 54605,
  "stdin_port": 56889,
  "control_port": 45289,
  "hb_port": 36937,
  "ip": "127.0.0.1",
  "key": "01b1b710-36d45b00166449cf0c8c0540",
  "transport": "tcp",
  "signature_scheme": "hmac-sha256",
  "kernel_name": ""
}