<?xml version="1.0" encoding="UTF-8"?>
<!-- Created with Inkscape (http://www.inkscape.org/) -->
<svg id="svg6" version="1.1" viewBox="0 0 32 32" xmlns="http://www.w3.org/2000/svg" xmlns:cc="http://creativecommons.org/ns#" xmlns:dc="http://purl.org/dc/elements/1.1/" xmlns:rdf="http://www.w3.org/1999/02/22-rdf-syntax-ns#">
 <metadata id="metadata2">
  <rdf:RDF>
   <cc:Work rdf:about="">
    <dc:format>image/svg+xml</dc:format>
    <dc:type rdf:resource="http://purl.org/dc/dcmitype/StillImage"/>
    <dc:title/>
   </cc:Work>
  </rdf:RDF>
 </metadata>
 <g id="g843" transform="matrix(2.3511 2.3511 -2.3511 2.3511 -72.662 -196.67)" fill="#d60000">
  <g id="g862" fill="#d60000">
   <path id="path1767" d="m59.836 25.934 3.8079-0.01863v-3.7893l0.86586-0.01862 0.01396 3.8126 3.8079 0.0093 0.01396 0.01396v0.84724l-3.8079 0.01862-0.01863 0.01863-0.01396 3.7753-0.01863 0.01863h-0.84724l-0.01396-3.8033-3.8079-0.01862z" fill="#d60000"/>
  </g>
 </g>
</svg>
