id;type;sigle;libelle
1;DirectionGenerale;Stagiaire optical;Bacon
2;DirectionTechnique;c a payment;Borders
3;Service;c indexing eyeballs;Account Manat Games
4;Service;la Integrated;dynamic index
5;DirectionGenerale;panel Designer context-sensitive;sensor
6;Service;Shoes;withdrawal invoice indexing
7;DirectionCentrale;c multi-byte b;Baby Borders Namibie
8;DirectionGenerale;Mandatory;streamline
9;Service;deposit;virtual Jewelery enhance
10;DirectionCentrale;a Nord-Pas-de-Calais;SSL
