C:\Users\alano.gonzalez\Documents\workspace-spring-tool-suite-4-4.4.1.RELEASE\Proyecto Final\proyecto-final\FinalProject\Proyecto\src\test\java\com\softtek\academy\proyecto\daos\UserExcelDaoTest.java
C:\Users\alano.gonzalez\Documents\workspace-spring-tool-suite-4-4.4.1.RELEASE\Proyecto Final\proyecto-final\FinalProject\Proyecto\src\test\java\com\softtek\academy\proyecto\repositories\MonthTimeJpaRepositoryTest.java
C:\Users\alano.gonzalez\Documents\workspace-spring-tool-suite-4-4.4.1.RELEASE\Proyecto Final\proyecto-final\FinalProject\Proyecto\src\test\java\com\softtek\academy\proyecto\repositories\UserJpaRepositoryTest.java
C:\Users\alano.gonzalez\Documents\workspace-spring-tool-suite-4-4.4.1.RELEASE\Proyecto Final\proyecto-final\FinalProject\Proyecto\src\test\java\com\softtek\academy\proyecto\service\UserServiceTest.java
