OID,Sector Name,Latitude,Longitude,Manufaturer,Model,Voltage
1,North,"47,414077758789","8,1859521865845",Alstom,AB-2019,110V
2,West,"47,408493041992","8,1785545349121",GE,AB-2010,330V
3,South,"47,408493041992","8,1785545349121",Alstom,AB-2001,220V
4,West,"47,401351928711","8,1741790771484",GE,AB-2019,330V
5,East,"47,401371002197","8,1779613494873",Alstom,AB-2010,330V
6,South,"47,399787902832","8,176383972168",GE,AB-2001,220V
7,West,"47,412792205811","8,1527070999146",Alstom,AB-2019,330V
8,East,"47,397979736328","8,1367530822754",GE,AB-2010,330V
9,West,"47,387996673584","8,1240291595459",Alstom,AB-2019,220V
10,South,"47,389019012451","8,1254978179932",GE,AB-2001,330V
