// Gmsh project created on Tue Jan  9 10:19:34 2024
//+
Mesh.MshFileVersion = 2.2;
SetFactory("OpenCASCADE");
Circle(1) = {0, 0, 0, 1, 0, 2*Pi};
//Ellipse(1) = {-0, 0, 0, 1.0, 0.5, 0, 2*Pi};
//+
Physical Curve(1) = {1};
//+
