$MeshFormat
2.2 0 8
$EndMeshFormat
$Nodes
103
1 0.025 0.06 0
2 -0.025 0 0
3 0.025 0 0
4 -0.025 0.06 0
5 0 0.06 0
6 0 0 0
7 0.025 0.009999999999977303 0
8 0.025 0.01999999999994688 0
9 0.025 0.02999999999991614 0
10 0.025 0.03999999999994549 0
11 0.025 0.04999999999997275 0
12 0.01704482181659349 0.06 0
13 0.01035533953622784 0.06 0
14 0.004730178487415658 0.06 0
15 0 0.05500000000001094 0
16 0 0.05000000000002505 0
17 0 0.04500000000003962 0
18 0 0.04000000000005419 0
19 0 0.0350000000000701 0
20 0 0.03000000000008535 0
21 0 0.02500000000006941 0
22 0 0.0200000000000555 0
23 0 0.01500000000004163 0
24 0 0.01000000000002775 0
25 0 0.005000000000013868 0
26 0.004730178487394862 0 0
27 0.0103553395361737 0 0
28 0.0170448218165475 0 0
29 -0.004730178487394862 0 0
30 -0.0103553395361737 0 0
31 -0.0170448218165475 0 0
32 -0.025 0.009999999999977303 0
33 -0.025 0.01999999999994688 0
34 -0.025 0.02999999999991614 0
35 -0.025 0.03999999999994549 0
36 -0.025 0.04999999999997275 0
37 -0.01704482181659349 0.06 0
38 -0.01035533953622784 0.06 0
39 -0.004730178487415658 0.06 0
40 0.004487305360350362 0.01251396985133904 0
41 0.00457251399675862 0.04707639289852563 0
42 0.0043301270189087 0.0325000000000777 0
43 0.004963923584819839 0.02301319960948036 0
44 0.01370008067641067 0.0546676030191937 0
45 0.01332366398521877 0.005073035464441256 0
46 0.01633974596215712 0.0349999999999308 0
47 0.01696491383149715 0.01689125430231536 0
48 0.01740465787745352 0.02499507532645675 0
49 0.007647285025846663 0.004388496540444168 0
50 0.007793113331778598 0.05545480113925228 0
51 0.009999224293311156 0.04962123729230251 0
52 0.008658955378643963 0.04222628769763687 0
53 0.01627656383242727 0.04371989234172131 0
54 0.008843765794086252 0.009111546076828172 0
55 0.01065653697628313 0.02073626808500293 0
56 0.009692834025662529 0.02757496550016661 0
57 0.00433012701893421 0.01750000000004856 0
58 0.004330127018917981 0.02750000000007737 0
59 0.004420325709637576 0.03787104794965932 0
60 0.009393794884050018 0.0350000000000702 0
61 0.004097424196141442 0.007448022856500346 0
62 0.003530359017008032 0.04243474570918312 0
63 0.009659814875403848 0.01463652534765668 0
64 0.003627725526114857 0.05250000000001797 0
65 0.01988178059733983 0.005514384917397564 0
66 0.0198771723058507 0.05453561160419781 0
67 0.00360618899656538 0.003674124670349087 0
68 0.01286677042319048 0.0393305586553001 0
69 0.003595779980649329 0.05633572263029445 0
70 0.01671364894962517 0.05032380996447277 0
71 0.01491891758798358 0.01019377460468214 0
72 -0.004487305360350362 0.01251396985133904 -0
73 -0.004572513996758631 0.04707639289852564 -0
74 -0.0043301270189087 0.03250000000007772 -0
75 -0.004963923584819839 0.02301319960948037 -0
76 -0.01370008067641066 0.05466760301919371 -0
77 -0.01332366398521877 0.005073035464441258 -0
78 -0.01633974596215712 0.03499999999993082 -0
79 -0.01696491383149714 0.01689125430231537 -0
80 -0.01740465787745352 0.02499507532645676 -0
81 -0.007647285025846664 0.00438849654044417 -0
82 -0.007793113331778599 0.05545480113925229 -0
83 -0.009999224293311166 0.04962123729230252 -0
84 -0.008658955378643972 0.04222628769763689 -0
85 -0.01627656383242728 0.04371989234172131 -0
86 -0.008843765794086253 0.009111546076828176 -0
87 -0.01065653697628313 0.02073626808500294 -0
88 -0.009692834025662525 0.02757496550016662 -0
89 -0.004330127018934205 0.01750000000004856 -0
90 -0.004330127018917986 0.02750000000007739 -0
91 -0.004420325709637581 0.03787104794965933 -0
92 -0.009393794884050018 0.03500000000007022 -0
93 -0.004097424196141442 0.007448022856500348 -0
94 -0.003530359017008036 0.04243474570918313 -0
95 -0.009659814875403848 0.01463652534765668 -0
96 -0.003627725526114829 0.05250000000001798 -0
97 -0.01988178059733983 0.005514384917397565 -0
98 -0.0198771723058507 0.0545356116041978 -0
99 -0.003606188996565379 0.003674124670349087 -0
100 -0.01286677042319047 0.0393305586553001 -0
101 -0.003595779980649316 0.05633572263029445 -0
102 -0.01671364894962519 0.05032380996447278 -0
103 -0.01491891758798358 0.01019377460468214 -0
$EndNodes
$Elements
204
1 1 2 3 1 3 7
2 1 2 3 1 7 8
3 1 2 3 1 8 9
4 1 2 3 1 9 10
5 1 2 3 1 10 11
6 1 2 3 1 11 1
7 1 2 4 2 1 12
8 1 2 4 2 12 13
9 1 2 4 2 13 14
10 1 2 4 2 14 5
11 1 2 1 4 6 26
12 1 2 1 4 26 27
13 1 2 1 4 27 28
14 1 2 1 4 28 3
15 1 2 1 5 6 29
16 1 2 1 5 29 30
17 1 2 1 5 30 31
18 1 2 1 5 31 2
19 1 2 5 6 2 32
20 1 2 5 6 32 33
21 1 2 5 6 33 34
22 1 2 5 6 34 35
23 1 2 5 6 35 36
24 1 2 5 6 36 4
25 1 2 4 7 4 37
26 1 2 4 7 37 38
27 1 2 4 7 38 39
28 1 2 4 7 39 5
29 2 2 0 1 47 48 55
30 2 2 0 1 46 53 68
31 2 2 0 1 56 46 60
32 2 2 0 1 47 8 48
33 2 2 0 1 46 10 53
34 2 2 0 1 41 51 64
35 2 2 0 1 48 46 56
36 2 2 0 1 51 50 64
37 2 2 0 1 53 11 70
38 2 2 0 1 10 11 53
39 2 2 0 1 52 59 60
40 2 2 0 1 13 14 50
41 2 2 0 1 43 55 56
42 2 2 0 1 55 43 57
43 2 2 0 1 9 46 48
44 2 2 0 1 7 8 47
45 2 2 0 1 9 10 46
46 2 2 0 1 7 47 71
47 2 2 0 1 42 56 60
48 2 2 0 1 59 52 62
49 2 2 0 1 50 14 69
50 2 2 0 1 8 9 48
51 2 2 0 1 55 57 63
52 2 2 0 1 44 13 50
53 2 2 0 1 65 7 71
54 2 2 0 1 43 56 58
55 2 2 0 1 63 54 71
56 2 2 0 1 52 60 68
57 2 2 0 1 54 40 61
58 2 2 0 1 26 27 49
59 2 2 0 1 56 42 58
60 2 2 0 1 51 41 52
61 2 2 0 1 49 54 61
62 2 2 0 1 27 28 45
63 2 2 0 1 12 13 44
64 2 2 0 1 27 45 49
65 2 2 0 1 11 1 66
66 2 2 0 1 3 7 65
67 2 2 0 1 47 55 63
68 2 2 0 1 55 48 56
69 2 2 0 1 49 45 54
70 2 2 0 1 44 50 51
71 2 2 0 1 47 63 71
72 2 2 0 1 25 6 67
73 2 2 0 1 6 26 67
74 2 2 0 1 5 15 69
75 2 2 0 1 14 5 69
76 2 2 0 1 28 3 65
77 2 2 0 1 1 12 66
78 2 2 0 1 23 24 40
79 2 2 0 1 16 17 41
80 2 2 0 1 22 23 57
81 2 2 0 1 18 19 59
82 2 2 0 1 20 21 58
83 2 2 0 1 21 22 43
84 2 2 0 1 19 20 42
85 2 2 0 1 24 25 61
86 2 2 0 1 17 18 62
87 2 2 0 1 51 52 53
88 2 2 0 1 40 24 61
89 2 2 0 1 52 41 62
90 2 2 0 1 23 40 57
91 2 2 0 1 16 41 64
92 2 2 0 1 15 16 64
93 2 2 0 1 41 17 62
94 2 2 0 1 26 49 67
95 2 2 0 1 43 22 57
96 2 2 0 1 19 42 59
97 2 2 0 1 11 66 70
98 2 2 0 1 42 20 58
99 2 2 0 1 21 43 58
100 2 2 0 1 18 59 62
101 2 2 0 1 45 28 65
102 2 2 0 1 12 44 66
103 2 2 0 1 40 54 63
104 2 2 0 1 59 42 60
105 2 2 0 1 57 40 63
106 2 2 0 1 45 65 71
107 2 2 0 1 61 25 67
108 2 2 0 1 53 52 68
109 2 2 0 1 60 46 68
110 2 2 0 1 44 51 70
111 2 2 0 1 66 44 70
112 2 2 0 1 49 61 67
113 2 2 0 1 51 53 70
114 2 2 0 1 54 45 71
115 2 2 0 1 15 64 69
116 2 2 0 1 64 50 69
117 2 2 1 2 79 80 87
118 2 2 1 2 78 85 100
119 2 2 1 2 88 78 92
120 2 2 1 2 79 33 80
121 2 2 1 2 78 35 85
122 2 2 1 2 73 83 96
123 2 2 1 2 80 78 88
124 2 2 1 2 83 82 96
125 2 2 1 2 85 36 102
126 2 2 1 2 35 36 85
127 2 2 1 2 84 91 92
128 2 2 1 2 38 39 82
129 2 2 1 2 75 87 88
130 2 2 1 2 87 75 89
131 2 2 1 2 34 78 80
132 2 2 1 2 32 33 79
133 2 2 1 2 34 35 78
134 2 2 1 2 32 79 103
135 2 2 1 2 74 88 92
136 2 2 1 2 91 84 94
137 2 2 1 2 82 39 101
138 2 2 1 2 33 34 80
139 2 2 1 2 87 89 95
140 2 2 1 2 76 38 82
141 2 2 1 2 97 32 103
142 2 2 1 2 75 88 90
143 2 2 1 2 95 86 103
144 2 2 1 2 84 92 100
145 2 2 1 2 86 72 93
146 2 2 1 2 29 30 81
147 2 2 1 2 88 74 90
148 2 2 1 2 83 73 84
149 2 2 1 2 81 86 93
150 2 2 1 2 30 31 77
151 2 2 1 2 37 38 76
152 2 2 1 2 30 77 81
153 2 2 1 2 36 4 98
154 2 2 1 2 2 32 97
155 2 2 1 2 79 87 95
156 2 2 1 2 87 80 88
157 2 2 1 2 81 77 86
158 2 2 1 2 76 82 83
159 2 2 1 2 79 95 103
160 2 2 1 2 25 6 99
161 2 2 1 2 6 29 99
162 2 2 1 2 5 15 101
163 2 2 1 2 39 5 101
164 2 2 1 2 31 2 97
165 2 2 1 2 4 37 98
166 2 2 1 2 23 24 72
167 2 2 1 2 16 17 73
168 2 2 1 2 22 23 89
169 2 2 1 2 18 19 91
170 2 2 1 2 20 21 90
171 2 2 1 2 21 22 75
172 2 2 1 2 19 20 74
173 2 2 1 2 24 25 93
174 2 2 1 2 17 18 94
175 2 2 1 2 83 84 85
176 2 2 1 2 72 24 93
177 2 2 1 2 84 73 94
178 2 2 1 2 23 72 89
179 2 2 1 2 16 73 96
180 2 2 1 2 15 16 96
181 2 2 1 2 73 17 94
182 2 2 1 2 29 81 99
183 2 2 1 2 75 22 89
184 2 2 1 2 19 74 91
185 2 2 1 2 36 98 102
186 2 2 1 2 74 20 90
187 2 2 1 2 21 75 90
188 2 2 1 2 18 91 94
189 2 2 1 2 77 31 97
190 2 2 1 2 37 76 98
191 2 2 1 2 72 86 95
192 2 2 1 2 91 74 92
193 2 2 1 2 89 72 95
194 2 2 1 2 77 97 103
195 2 2 1 2 93 25 99
196 2 2 1 2 85 84 100
197 2 2 1 2 92 78 100
198 2 2 1 2 76 83 102
199 2 2 1 2 98 76 102
200 2 2 1 2 81 93 99
201 2 2 1 2 83 85 102
202 2 2 1 2 86 77 103
203 2 2 1 2 15 96 101
204 2 2 1 2 96 82 101
$EndElements
