-------------------------------------------------------------------------------
Test set: de.awacademy.meineKleineGluecklicheTurbine.services.UserServiceTest
-------------------------------------------------------------------------------
Tests run: 1, Failures: 0, Errors: 0, Skipped: 0, Time elapsed: 0.094 sec
