{
	"id": "17f2d48e-ac5a-4ca8-a3c3-cba3b7ba8fd6",
	"name": "Craft Beer",
	"values": [
		{
			"key": "APP_URL",
			"value": "",
			"enabled": true
		},
		{
			"key": "ID",
			"value": "",
			"enabled": true
		}
	],
	"_postman_variable_scope": "environment",
	"_postman_exported_at": "2020-08-12T08:19:06.223Z",
	"_postman_exported_using": "Postman/7.30.0"
}