[{"short": "AF", "long": "AFG"},
{"short": "AL", "long": "ALB"},
{"short": "DZ", "long": "DZA"},
{"short": "AS", "long": "ASM"},
{"short": "AD", "long": "AND"},
{"short": "AO", "long": "AGO"},
{"short": "AI", "long": "AIA"},
{"short": "AG", "long": "ATG"},
{"short": "AR", "long": "ARG"},
{"short": "AM", "long": "ARM"},
{"short": "AW", "long": "ABW"},
{"short": "AU", "long": "AUS"},
{"short": "AT", "long": "AUT"},
{"short": "AZ", "long": "AZE"},
{"short": "BS", "long": "BHS"},
{"short": "BH", "long": "BHR"},
{"short": "BD", "long": "BGD"},
{"short": "BB", "long": "BRB"},
{"short": "BY", "long": "BLR"},
{"short": "BE", "long": "BEL"},
{"short": "BZ", "long": "BLZ"},
{"short": "BJ", "long": "BEN"},
{"short": "BM", "long": "BMU"},
{"short": "BT", "long": "BTN"},
{"short": "BO", "long": "BOL"},
{"short": "BA", "long": "BIH"},
{"short": "BW", "long": "BWA"},
{"short": "BR", "long": "BRA"},
{"short": "VG", "long": "VGB"},
{"short": "BN", "long": "BRN"},
{"short": "BG", "long": "BGR"},
{"short": "BF", "long": "BFA"},
{"short": "BI", "long": "BDI"},
{"short": "KH", "long": "KHM"},
{"short": "CM", "long": "CMR"},
{"short": "CA", "long": "CAN"},
{"short": "CV", "long": "CPV"},
{"short": "KY", "long": "CYM"},
{"short": "CF", "long": "CAF"},
{"short": "TD", "long": "TCD"},
{"short": "CL", "long": "CHL"},
{"short": "CN", "long": "CHN"},
{"short": "CO", "long": "COL"},
{"short": "KM", "long": "COM"},
{"short": "CK", "long": "COK"},
{"short": "CR", "long": "CRI"},
{"short": "HR", "long": "HRV"},
{"short": "CU", "long": "CUB"},
{"short": "CW", "long": "CUW"},
{"short": "CY", "long": "CYP"},
{"short": "CZ", "long": "CZE"},
{"short": "DK", "long": "DNK"},
{"short": "DJ", "long": "DJI"},
{"short": "DM", "long": "DMA"},
{"short": "DO", "long": "DOM"},
{"short": "CD", "long": "COD"},
{"short": "EC", "long": "ECU"},
{"short": "EG", "long": "EGY"},
{"short": "SV", "long": "SLV"},
{"short": "GQ", "long": "GNQ"},
{"short": "ER", "long": "ERI"},
{"short": "EE", "long": "EST"},
{"short": "ET", "long": "ETH"},
{"short": "FK", "long": "FLK"},
{"short": "FO", "long": "FRO"},
{"short": "FJ", "long": "FJI"},
{"short": "FI", "long": "FIN"},
{"short": "FR", "long": "FRA"},
{"short": "GF", "long": "GUF"},
{"short": "PF", "long": "PYF"},
{"short": "GA", "long": "GAB"},
{"short": "GM", "long": "GMB"},
{"short": "GE", "long": "GEO"},
{"short": "DE", "long": "DEU"},
{"short": "GH", "long": "GHA"},
{"short": "GI", "long": "GIB"},
{"short": "GR", "long": "GRC"},
{"short": "GL", "long": "GRL"},
{"short": "GD", "long": "GRD"},
{"short": "GP", "long": "GLP"},
{"short": "GU", "long": "GUM"},
{"short": "GT", "long": "GTM"},
{"short": "GN", "long": "GIN"},
{"short": "GW", "long": "GNB"},
{"short": "GY", "long": "GUY"},
{"short": "HT", "long": "HTI"},
{"short": "HN", "long": "HND"},
{"short": "HK", "long": "HKG"},
{"short": "HU", "long": "HUN"},
{"short": "IS", "long": "ISL"},
{"short": "IN", "long": "IND"},
{"short": "ID", "long": "IDN"},
{"short": "IR", "long": "IRN"},
{"short": "IQ", "long": "IRQ"},
{"short": "IE", "long": "IRL"},
{"short": "IM", "long": "IMN"},
{"short": "IL", "long": "ISR"},
{"short": "IT", "long": "ITA"},
{"short": "CI", "long": "CIV"},
{"short": "JM", "long": "JAM"},
{"short": "JP", "long": "JPN"},
{"short": "JO", "long": "JOR"},
{"short": "KZ", "long": "KAZ"},
{"short": "KE", "long": "KEN"},
{"short": "KI", "long": "KIR"},
{"short": "KW", "long": "KWT"},
{"short": "KG", "long": "KGZ"},
{"short": "LA", "long": "LAO"},
{"short": "LV", "long": "LVA"},
{"short": "LB", "long": "LBN"},
{"short": "LS", "long": "LSO"},
{"short": "LR", "long": "LBR"},
{"short": "LY", "long": "LBY"},
{"short": "LI", "long": "LIE"},
{"short": "LT", "long": "LTU"},
{"short": "LU", "long": "LUX"},
{"short": "MO", "long": "MAC"},
{"short": "MK", "long": "MKD"},
{"short": "MG", "long": "MDG"},
{"short": "MW", "long": "MWI"},
{"short": "MY", "long": "MYS"},
{"short": "MV", "long": "MDV"},
{"short": "ML", "long": "MLI"},
{"short": "MT", "long": "MLT"},
{"short": "MH", "long": "MHL"},
{"short": "MQ", "long": "MTQ"},
{"short": "MR", "long": "MRT"},
{"short": "MU", "long": "MUS"},
{"short": "YT", "long": "MYT"},
{"short": "MX", "long": "MEX"},
{"short": "FM", "long": "FSM"},
{"short": "MD", "long": "MDA"},
{"short": "MC", "long": "MCO"},
{"short": "MN", "long": "MNG"},
{"short": "ME", "long": "MNE"},
{"short": "MS", "long": "MSR"},
{"short": "MA", "long": "MAR"},
{"short": "MZ", "long": "MOZ"},
{"short": "MM", "long": "MMR"},
{"short": "NA", "long": "NAM"},
{"short": "NR", "long": "NRU"},
{"short": "NP", "long": "NPL"},
{"short": "NL", "long": "NLD"},
{"short": "NC", "long": "NCL"},
{"short": "NZ", "long": "NZL"},
{"short": "NI", "long": "NIC"},
{"short": "NE", "long": "NER"},
{"short": "NG", "long": "NGA"},
{"short": "NU", "long": "NIU"},
{"short": "KP", "long": "PRK"},
{"short": "MP", "long": "MNP"},
{"short": "NO", "long": "NOR"},
{"short": "OM", "long": "OMN"},
{"short": "PK", "long": "PAK"},
{"short": "PW", "long": "PLW"},
{"short": "PS", "long": "PSE"},
{"short": "PA", "long": "PAN"},
{"short": "PG", "long": "PNG"},
{"short": "PY", "long": "PRY"},
{"short": "PE", "long": "PER"},
{"short": "PH", "long": "PHL"},
{"short": "PL", "long": "POL"},
{"short": "PT", "long": "PRT"},
{"short": "PR", "long": "PRI"},
{"short": "QA", "long": "QAT"},
{"short": "CG", "long": "COG"},
{"short": "RE", "long": "REU"},
{"short": "RO", "long": "ROU"},
{"short": "RU", "long": "RUS"},
{"short": "RW", "long": "RWA"},
{"short": "BL", "long": "BLM"},
{"short": "KN", "long": "KNA"},
{"short": "LC", "long": "LCA"},
{"short": "MF", "long": "MAF"},
{"short": "PM", "long": "SPM"},
{"short": "VC", "long": "VCT"},
{"short": "WS", "long": "WSM"},
{"short": "SM", "long": "SMR"},
{"short": "ST", "long": "STP"},
{"short": "SA", "long": "SAU"},
{"short": "SN", "long": "SEN"},
{"short": "RS", "long": "SRB"},
{"short": "SC", "long": "SYC"},
{"short": "SL", "long": "SLE"},
{"short": "SG", "long": "SGP"},
{"short": "SX", "long": "SXM"},
{"short": "SK", "long": "SVK"},
{"short": "SI", "long": "SVN"},
{"short": "SB", "long": "SLB"},
{"short": "SO", "long": "SOM"},
{"short": "ZA", "long": "ZAF"},
{"short": "KR", "long": "KOR"},
{"short": "SS", "long": "SSD"},
{"short": "ES", "long": "ESP"},
{"short": "LK", "long": "LKA"},
{"short": "SD", "long": "SDN"},
{"short": "SR", "long": "SUR"},
{"short": "SZ", "long": "SWZ"},
{"short": "SE", "long": "SWE"},
{"short": "CH", "long": "CHE"},
{"short": "SY", "long": "SYR"},
{"short": "TW", "long": "TWN"},
{"short": "TJ", "long": "TJK"},
{"short": "TZ", "long": "TZA"},
{"short": "TH", "long": "THA"},
{"short": "TL", "long": "TLS"},
{"short": "TG", "long": "TGO"},
{"short": "TK", "long": "TKL"},
{"short": "TO", "long": "TON"},
{"short": "TT", "long": "TTO"},
{"short": "TN", "long": "TUN"},
{"short": "TR", "long": "TUR"},
{"short": "TM", "long": "TKM"},
{"short": "TC", "long": "TCA"},
{"short": "TV", "long": "TUV"},
{"short": "UG", "long": "UGA"},
{"short": "UA", "long": "UKR"},
{"short": "AE", "long": "ARE"},
{"short": "GB", "long": "GBR"},
{"short": "US", "long": "USA"},
{"short": "VI", "long": "VIR"},
{"short": "UY", "long": "URY"},
{"short": "UZ", "long": "UZB"},
{"short": "VU", "long": "VUT"},
{"short": "VA", "long": "VAT"},
{"short": "VE", "long": "VEN"},
{"short": "VN", "long": "VNM"},
{"short": "WF", "long": "WLF"},
{"short": "EH", "long": "ESH"},
{"short": "YE", "long": "YEM"},
{"short": "ZM", "long": "ZMB"},
{"short": "ZW", "long": "ZWE"}]