{
  "project_info": {
    "project_number": "481903517449",
    "project_id": "alandelacruzmap",
    "storage_bucket": "alandelacruzmap.appspot.com"
  },
  "client": [
    {
      "client_info": {
        "mobilesdk_app_id": "1:481903517449:android:0d4142e9dea0176c317dd8",
        "android_client_info": {
          "package_name": "com.example.maps_app_alandelacruz"
        }
      },
      "oauth_client": [
        {
          "client_id": "481903517449-h90pithr6ttsq69jjdn0npkbkmq6sdsb.apps.googleusercontent.com",
          "client_type": 1,
          "android_info": {
            "package_name": "com.example.maps_app_alandelacruz",
            "certificate_hash": "6d62d70d0c777c10bffddebae49ceb636098c99f"
          }
        },
        {
          "client_id": "481903517449-t4fcht9gl4abbk4lpqd8vm7q8a94fmta.apps.googleusercontent.com",
          "client_type": 3
        }
      ],
      "api_key": [
        {
          "current_key": "AIzaSyAOHgAKxtLTHolhK04z1aKyOFE-Anfiwvc"
        }
      ],
      "services": {
        "appinvite_service": {
          "other_platform_oauth_client": [
            {
              "client_id": "481903517449-t4fcht9gl4abbk4lpqd8vm7q8a94fmta.apps.googleusercontent.com",
              "client_type": 3
            }
          ]
        }
      }
    }
  ],
  "configuration_version": "1"
}