id;nom;prenom;poste_actuel;anciennete
1;Designer;generate;capacity;12839
2;online;exuding;Tuna sensor;42282
3;solid state Agent Vanuatu;Chad Music;hard drive Towels Palestinian Territory;1768
4;system portal;reboot Interactions;Unbranded Wooden Keyboard Loaf Steel;79754
5;Tunnel;Cambridgeshire;Frozen Hat monitor;15336
6;Chief projection support;lavender Avon Incredible Steel Gloves;FTP port seamless;77414
7;Central XML Uganda;Personal Loan Account sky blue Table;morph;33927
8;morph;Virginia;disintermediate vortals;11095
9;calculate violet;capability Re-engineered;Puerto Rico monitor microchip;2663
10;world-class approach;Czech Koruna;Indiana;7616
