{
  "name": "Experience",
  "fields": [
    {
      "fieldName": "firstName",
      "fieldType": "String",
      "javadoc": "The firstname attribute."
    },
    {
      "fieldName": "lastName",
      "fieldType": "String"
    },
    {
      "fieldName": "email",
      "fieldType": "String"
    },
    {
      "fieldName": "phoneNumber",
      "fieldType": "String"
    },
    {
      "fieldName": "hireDate",
      "fieldType": "Instant"
    },
    {
      "fieldName": "salary",
      "fieldType": "Long"
    },
    {
      "fieldName": "commissionPct",
      "fieldType": "Long"
    }
  ],
  "relationships": [
    {
      "relationshipType": "many-to-one",
      "otherEntityName": "ressourcePropose",
      "otherEntityRelationshipName": "experience",
      "relationshipName": "ressourcePropose",
      "otherEntityField": "id"
    }
  ],
  "changelogDate": "20210518095945",
  "javadoc": "The Employee entity.",
  "entityTableName": "experience",
  "dto": "mapstruct",
  "pagination": "pagination",
  "service": "serviceImpl",
  "jpaMetamodelFiltering": false,
  "fluentMethods": true,
  "readOnly": false,
  "embedded": false,
  "clientRootFolder": "",
  "applications": "*"
}
