id;etablissemnt;date_entree;date_sortie;ville;pays;titre;specialite
1;Shirt Georgia;Harbor grey capacitor;SCSI Granite grow;Interactions EXE Unbranded Granite Towels;bi-directional;Oklahoma Awesome internet solution;Iranian Rial Massachusetts Granite
2;overriding full-range firewall;next generation facilitate leverage;Ouguiya Italy orchid;Health Unbranded;Ball architectures Extended;transmitter Avon mobile;Avon 24/7 Kwanza
3;asymmetric leading-edge;Bedfordshire purple Granite;Garden front-end Buckinghamshire;Berkshire online Towels;Plastic;Functionality Refined Steel Computer sensor;Buckinghamshire Bouvet Island (Bouvetoya) Director
4;withdrawal facilitate Car;turn-key Chief;Analyst invoice;Hat Garden;Australia bypassing index;digital Strategist;calculate withdrawal haptic
5;Denar;Money Market Account dynamic synthesize;backing up;driver card program;navigate;project intuitive interfaces;Buckinghamshire Georgia non-volatile
6;Orchestrator;Maine Borders;data-warehouse Malta Plastic;bandwidth black multi-byte;Vatu;Auto Loan Account knowledge base;bypass
7;repurpose;West Virginia Kentucky;service-desk;cross-platform;redefine Berkshire pink;input backing up;Tokelau
8;Antarctica (the territory South of 60 deg S) Mobility;Intuitive;open architecture HTTP;withdrawal;encryption logistical;Sleek;bypass
9;Rubber;deposit functionalities;Pants Checking Account Oklahoma;Illinois;Intelligent Metal Bike Benin Secured;Secured Wyoming;implementation hacking
10;Refined haptic backing up;South Africa functionalities transmitter;architectures Cloned Team-oriented;overriding productivity;Cross-group Buckinghamshire navigate;Qatar;user-facing USB leading-edge
