id;emploi_actuel;anciennete_etude;anciennete_emploi;fonction;nb_ressources
1;Central African Republic;Islands Inlet Licensed Plastic Bike;back-end;Implemented sensor;98019
2;content Grocery;Mountain;content-based Ergonomic paradigm;user-facing frictionless;2508
3;end-to-end card Buckinghamshire;Mews;Jersey Cambridgeshire;Investor;82556
4;streamline;Facilitator grey;technologies microchip;Technician portal;63822
5;RAM Bond Markets Units European Composite Unit (EURCO);back-end Rubber Pakistan Rupee;Designer;Gorgeous Pizza;25651
6;Vision-oriented Wooden e-business;bluetooth Via zero defect;Pitcairn Islands;driver disintermediate Usability;29383
7;Up-sized Checking Account;invoice 6th generation Fall;user-facing disintermediate;Electronics;25936
8;Integrated Burkina Faso;Gorgeous Cotton Car;transmitter;turquoise holistic Buckinghamshire;51184
9;Sausages User-friendly granular;Generic Buckinghamshire empower;Berkshire collaboration;turn-key strategic;44479
10;SCSI;Fresh payment;enterprise Unbranded;Handmade Wooden Bike Street;48364
