{
  "name": "RessourcePropose",
  "fields": [
    {
      "fieldName": "nom",
      "fieldType": "String",
      "fieldValidateRules": ["required"]
    },
    {
      "fieldName": "prenom",
      "fieldType": "String"
    },
    {
      "fieldName": "posteActuel",
      "fieldType": "String"
    },
    {
      "fieldName": "anciennete",
      "fieldType": "Integer"
    }
  ],
  "relationships": [
    {
      "relationshipType": "one-to-many",
      "otherEntityName": "certification",
      "otherEntityRelationshipName": "ressourcePropose",
      "relationshipName": "certification"
    },
    {
      "relationshipType": "one-to-many",
      "otherEntityName": "experience",
      "otherEntityRelationshipName": "ressourcePropose",
      "relationshipName": "experience"
    },
    {
      "relationshipType": "one-to-many",
      "otherEntityName": "formation",
      "otherEntityRelationshipName": "ressourcePropose",
      "relationshipName": "formation"
    },
    {
      "relationshipType": "many-to-one",
      "otherEntityName": "ressourceDemande",
      "otherEntityRelationshipName": "ressourcePropose",
      "relationshipName": "ressourceDemande",
      "otherEntityField": "id"
    },
    {
      "relationshipType": "many-to-one",
      "otherEntityName": "equipe",
      "otherEntityRelationshipName": "ressourcePropose",
      "relationshipName": "nomEquipe",
      "otherEntityField": "id"
    }
  ],
  "changelogDate": "20210518095745",
  "entityTableName": "ressource_propose",
  "dto": "mapstruct",
  "pagination": "pagination",
  "service": "serviceImpl",
  "jpaMetamodelFiltering": false,
  "fluentMethods": true,
  "readOnly": false,
  "embedded": false,
  "clientRootFolder": "",
  "applications": "*"
}
