{
  "name": "RessourceDemande",
  "fields": [
    {
      "fieldName": "emploiActuel",
      "fieldType": "String"
    },
    {
      "fieldName": "ancienneteEtude",
      "fieldType": "String"
    },
    {
      "fieldName": "ancienneteEmploi",
      "fieldType": "String"
    },
    {
      "fieldName": "fonction",
      "fieldType": "String"
    },
    {
      "fieldName": "nbRessources",
      "fieldType": "Integer"
    }
  ],
  "relationships": [
    {
      "relationshipType": "one-to-many",
      "otherEntityName": "ressourcePropose",
      "otherEntityRelationshipName": "ressourceDemande",
      "relationshipName": "ressourcePropose"
    },
    {
      "relationshipType": "many-to-one",
      "otherEntityName": "appelOffre",
      "otherEntityRelationshipName": "ressourceDemande",
      "relationshipName": "appelOffre",
      "otherEntityField": "id"
    }
  ],
  "changelogDate": "20210518095645",
  "javadoc": "not an ignored comment",
  "entityTableName": "ressource_demande",
  "dto": "mapstruct",
  "pagination": "pagination",
  "service": "serviceImpl",
  "jpaMetamodelFiltering": false,
  "fluentMethods": true,
  "readOnly": false,
  "embedded": false,
  "clientRootFolder": "",
  "applications": "*"
}
