id,name,model_id:id,group_id:id,perm_read,perm_write,perm_create,perm_unlink
access_otms_otms,otms.otms,model_otms_otms,base.group_user,1,1,1,1
access_otms_patient,otms.otms_patient,model_otms_patient,base.group_user,1,1,1,1
access_otms_employee,otms.otms_employee,model_otms_employee,base.group_user,1,1,1,1
access_otms_instrument,otms.otms_instrument,model_otms_instrument,base.group_user,1,1,1,1
access_otms_equipment,otms.otms_equipment,model_otms_equipment,base.group_user,1,1,1,1
access_otms_material,otms.otms_material,model_otms_material,base.group_user,1,1,1,1
access_otms_specialization,otms.otms_specialization,model_otms_specialization,base.group_user,1,1,1,1
access_otms_operation_surgical,otms.otms_operation_surgical,model_otms_operation_surgical,base.group_user,1,1,1,1
access_otms_operation_theatre,otms.otms_operation_theatre,model_otms_operation_theatre,base.group_user,1,1,1,1
