{
  "type": "service_account",
  "project_id": "blockgrid-15450",
  "private_key_id": "f0875c2d3c4b14a7b469b753a97171afcabecd53",
  "private_key": "-----BEGIN PRIVATE KEY-----\nMIIEvgIBADANBgkqhkiG9w0BAQEFAASCBKgwggSkAgEAAoIBAQDVvpARe2jk2n9D\nzLpH+h15Uxc4adkvgR6zhfEm2ghvNTSVmzw/m/L9MSOq/vqy6hzoseds93aykiAL\nPrIOWKDwRslk2ugtGuqfOorXdY82kXdIobaOYwrirP5z5rvH1buRyoChoyUmXKfw\nVdfb9Vwf7NeFjVuIL/r+IAd68tle0yxutuFeVGnY9+DimdPjnPaKmxp2DvUHZTlq\n5oRNbJ78hqpG/ui/FMDT12VQHSoAq2irTu+uNYDcs9k/DHlFPYUbS3b4RylMagAd\nBXU6UalQdsi31NaEp6F56hNKSSBZ4NXofeSQUen+dQ5CLkCjsK4Urc2XT28Eg47i\nePXxeNzxAgMBAAECggEAEuCoWHTr8hdmmUo38xKw3vXi1X+KuB55I82a+22TBGBg\ndyydTPhk5O39upTXtyzEVhxdRkNSW0na1OdqAiibeTElSRgo3I/1pA+/crFOL1l4\nXaSzqv5uGBBDjmC02bzDmsgV5YCzT6CsD+bDAGkahHLOY5wVFxF2w1I4mugfINfQ\nLFoK3DvPC/dCL1RH2HfeyQYTv+PNTLhCP2ScajLraBGa8xhUXYzL7Y/Ufywzofuu\nE2J47n7HK5kgz+++tW89kh70mxO9Ztl+VquFDzNe1AI7gyvp1OckWb90kdai6yiR\nrqebU3NvXXg0bV90sEVSTb3owL1xbBHVnpdyFxDKqQKBgQDxPeEnN4R3LtgnSirv\nH7Q4w3h/URj2DhISB+3UD1dLvvUujA2A7CIhvNDPbyMLXeLEO0CM69CaS3THPOUE\nhcdGeAx+eS79gCkWq6R0eT5uS9uoBmOLoJkVCl/zCRcwJi7CQr2hiLH2OE8YNhlr\ntJC4rJtWbvLQnQNK6awisdrOCQKBgQDi0gsvOpHFujFo4rjTKZHgXRvnhdz+NFnF\n4jvuBYLm779swteORmNSdv7jGgR44xEsqJmltMSdZZXObhGwb/ajxbF6sU/HPY4T\npW5ZjLpwyeEAk5HKDk0+B2xYnzc5KQ295pDuxDWE3T/BpOEe1HGNJWkPPeR0MAnJ\nHpW926ZRqQKBgH3R/U1b6k3S88/CIhRnn7J/WKhmnrMucYRP+F3Cxo/t/6iQSTa1\ncbPQ68NUvp1eETixgqA9GaZvtm93tiaes2lwkWuhPr3eiw+U5AgPeF1EWUMQWfjo\nAQ91QsfaNOra70ZIUukeB1tY0P/ar3V6ToTTGY2B/kiJq771kt7hjjIpAoGBAI/O\nWhb8jFWPgiocrM/8qCdXAQ0eGwn0iQJkOFjll6PxVy2OrvneeLRdC6dS5Ij8dfQZ\nhSjBXnLoaD10HbT+l6IoAilm58zLoxujpD4UclR2OjiSVzmDLcfpDvF1KJ8N/09q\nMnOfZMszN2v/rFdOnBvAH0bxl7luh5XC1W+FJoLZAoGBAJvcPiLxGQLe918Gl6MN\nNvtfn3qpqVXaFFVgBkXLOn9xHthbgJLGghF3xtSEx6kwgulbPlelOJpXgeednGjF\n9Eqkv9ApGaYlvH32rut42NWTvzMoF2LMC622wHEf8mjFPDfksBVzWnrDyYi654Uk\n9vLOSmw2EG2PLr0mRPUarIvb\n-----END PRIVATE KEY-----\n",
  "client_email": "firebase-adminsdk-j5hgz@blockgrid-15450.iam.gserviceaccount.com",
  "client_id": "111713071264938142117",
  "auth_uri": "https://accounts.google.com/o/oauth2/auth",
  "token_uri": "https://oauth2.googleapis.com/token",
  "auth_provider_x509_cert_url": "https://www.googleapis.com/oauth2/v1/certs",
  "client_x509_cert_url": "https://www.googleapis.com/robot/v1/metadata/x509/firebase-adminsdk-j5hgz%40blockgrid-15450.iam.gserviceaccount.com"
}
