{"vorhaben":[
"gemäß §20 DSGVO habe ich Anspruch darauf meine Daten übertragen zu lassen.",
"aus gegebenen Anlass möchte ich meine personenbezogenen Daten gemäß Artikel 20 der DSGVO übertragen lassen.",
"hiermit stelle ich einen Antrag auf Datenübertragung nach Art. 20 DSGVO.",
"hiermit möchte ich Sie gemäß Art.20 Datenschutz-Grundverordnung, um die Übertragung meiner personenbezogenen Daten bitten.",
"mit diesem Schreiben möchte ich von meinem Recht nach Art. 20 DSGVO Gebrauch machen, meine Daten an einen anderen Verantwortlichen zu übertragen.",
"auf mein Recht nach DSGVO Artikel 20 Absatz 2 berufend, fordere ich Sie auf, die über mich vorliegenden personenbezogenen Daten, an den von mir erwählten Verantwortlichen zu übertragen.",
"ich möchte, dass sie meine Daten, welche bei Ihnen gespeichert sind, übertragen.",
"mit diesem Schreiben, verlange ich von Ihnen, nach Artikel 20 DSGVO, meine personenbezogene Daten zu übertragen.",
"nach Artikel 20 Datenschutz-Grundverordnung habe ich das Recht, alle meine Daten in einem strukturierten und gängigen Format zu übertragen.",
"übertragen sie bitte meine Daten unverzüglich an einen anderen Verantwortlichen und löschen sie diese aus ihren Archiven."]
}

