{ "rechtlicher_Anspruch": 
["Sollten Sie meinem Löschungsersuchen nicht nachkommen, fordere ich Sie auf, Ihre Entscheidung mir gegenüber unter Angabe der gesetzlichen Grundlage unverzüglich zu begründen.",
"Bei Nichtbeachtung meiner Forderung werde ich mich an eine Datenschutzbehörde wenden. Zudem behalte ich mir weitere rechtliche Schritte vor, die auch die Geltendmachung von Schadenersatzansprüchen nach Artikel 82 DSGVO umfassen.",
"Sollten Sie meinem Löschungsersuchen nicht nachkommen, fordere ich Sie auf, Ihre Entscheidung mir gegenüber unter Angabe der gesetzlichen Grundlage unverzüglich zu begründen.",
"Falls dieser Bitte nicht nachgegangen wird, sehe ich mich gezwungen, rechtliche Schritte zu gehen, damit dies beendet wird.",
"Falls dies nicht geschieht, werde ich einen Anwalt kontaktieren, der dieses Problem aufgreift und löst.",
"Sollte ich spätestens in einem Monat nichts von Ihnen hören, so werde ich mich an den Datenschutzbeauftragten meiner Behörde wenden, der dieses Problem für mich lösen wird.",
"Sollten Sie entgegen meines Wunsch handeln, so werde ich rechtliche Schritte gegen Sie einleiten und ggf. einen daraus resultierenden Schadensersatzanspruch geltend machen."]
}

  