{
"nachname":["Müller",
"Schmidt",
"Schneider",
"Fischer",
"Weber",
"Meyer",
"Wagner",
"Becker",
"Schulz",
"Hoffmann",
"Schäfer",
"Koch",
"Bauer",
"Richter",
"Klein",
"Wolf",
"Schröder",
"Neumann",
"Schwarz",
"Zimmermann"]
}
