{"vorhabendetails":
["Mit diesem Schreiben möchte ich auch von meinem Recht gebrauch machen und bitte Sie daher meine personenbezogenen Daten an Digital Reset GbR zu übertragen, die sich mit Ihnen bezüglicher diese Sache in Kontakt setzen.",
"Ich bitte Sie, meine Daten an Digital Reset GbR zu senden, die sich dieser Sache annehmen.",
"Da ich meinen DSL Vertrag bei Ihnen gekündigt habe, möchte ich alle erhobenen Daten nun zum neuen Anbieter übertragen. Die Kontaktdaten des Unternehmens finden sie im Anhang.",
"Ich beantrage somit alle personenbezogenen Daten zu meiner Person an die VGH Niedersachsen zu übertragen.",
"Dazu gehören auch die Daten, die ich Ihnen durch die Nutzung Ihres Dienstes bereitstelle. Die Daten des Verantwortlichen, an die sie die Daten übertragen sollen, werde ich Ihnen, nach Absprache mit diesem, zukommen lassen.",
"Daher bitte ich um Datenübertragbarkeit an meinen neuen Mobilfunkanbieter. Die Kontaktdaten finden sie im Anhang",
"Aufgrund eines Kontowechsels zur ING Diba, möchte ich meine vorhandenen personenbezogenen Daten von Ihnen zur ING Diba übertrage lassen. Bitte übertragen Sie meine Daten auf direktem Wegen an die Bank und nicht über Umwege zu mir.",
"Weil ich zu einer anderen Arzt-Praxis wechseln werde, bitte ich Sie meine Patientendaten an die Praxis zu übertragen. Die Praxisdaten sind in der PDF, die sich im Anhang befindet, enthalten.",
"Der erwählte Verantwortliche ist die Digital Reset GbR, welche meine weiteren Probleme übernehmen wird.",
"Dazu gehören auch Transaktionsdaten und diese sollen in einem speziellen Format übertragen werden, damit sie schneller verarbeitet werden können. Diese sollen von Ihnen, nach der Übertragung, nicht weitergenutzt werden können. Die Informationen des Unternehmens werde ich Ihnen diese Woche zusenden.",
"Hiermit fordere Ich sie auf, dass sie meine persönlichen Daten an meinen neuen Arbeitgeber übertragen. Die Kontaktdaten und den neuen Arbeitsvertrag befindet sich im Anhang.",
"Dabei sollen alle relevanten Daten weitergegeben werden, die für die Personalabteilung benötigt werden. Der Verantwortliche wird sich bei Ihnen melden."]
}

