{"betreff": 
["Übertragung meiner Daten gem. Art 20 DSGVO",
"Datenübertragung",
"Übertragung meiner personenbezogenen Daten Art. 20 DSGVO",
"Datenportabilität",
"Datenübertragbarkeit gemäß Art. 20 DSGVO",
"Datenübertragbarkeit",
"Datenportabilität gem. Art. 20 DSGVO",
"Datentransfer wegen Umzug Art. 20 DSG-VO",
"Übertragung meiner persönlichen und privaten Daten",
"Recht auf Datenübertragbarkeit - Artikel 20"]
}



