{"anreden":["Sehr geehrter Herr",
"Sehr geehrte Frau",
"Guten Morgen Frau",
"Guten Morgen Herr",
"Guten Abend Frau",
"Guten Abend Herr",
"Guten Tag Frau",
"Guten Tag Herr",
"Hallo Frau",
"Hallo Herr",
"Hi Frau",
"Hi Herr",
"Liebe Frau",
"Lieber Herr",
"Liebes Team",
"Guten Morgen",
"Guten Tag",
"Guten Abend",
"Moin",
"Servus",
"Hey zusammen",
"Hallo zusammen",
"Hallo allerseits",
"Hi",
"Hey",
"Sehr geehrte Damen und Herren"]
}
