256           384           576           640           864           896           960           1296          
1344          1408          1440          1600          1664          1944          2016          2112          
2160          2176          2240          2400          2432          2496          2916          2944          
3024          3136          3168          3240          3264          3360          3520          3600          
3648          3712          3744          3968          4000          4160          4374          4416          
4536          4704          4736          4752          4860          4896          4928          5040          
5248          5280          5400          5440          5472          5504          5568          5600          
5616          5824          5952          6000          