^C:\USERS\SANYA\SOURCE\REPOS\FILL\DEBUG\FILL.OBJ
/OUT:"C:\USERS\SANYA\SOURCE\REPOS\FILL\DEBUG\FILL.EXE" /INCREMENTAL /NOLOGO KERNEL32.LIB USER32.LIB GDI32.LIB WINSPOOL.LIB COMDLG32.LIB ADVAPI32.LIB SHELL32.LIB OLE32.LIB OLEAUT32.LIB UUID.LIB ODBC32.LIB ODBCCP32.LIB /MANIFEST /MANIFESTUAC:"level='asInvoker' uiAccess='false'" /manifest:embed /DEBUG:FASTLINK /PDB:"C:\USERS\SANYA\SOURCE\REPOS\FILL\DEBUG\FILL.PDB" /SUBSYSTEM:CONSOLE /TLBID:1 /DYNAMICBASE /NXCOMPAT /IMPLIB:"C:\USERS\SANYA\SOURCE\REPOS\FILL\DEBUG\FILL.LIB" /MACHINE:X86 DEBUG\FILL.OBJ
^D:\USER-PC\DESKTOP\FILL\DEBUG\FILL.OBJ
/OUT:"D:\USER-PC\DESKTOP\FILL\DEBUG\FILL.EXE" /INCREMENTAL /NOLOGO KERNEL32.LIB USER32.LIB GDI32.LIB WINSPOOL.LIB COMDLG32.LIB ADVAPI32.LIB SHELL32.LIB OLE32.LIB OLEAUT32.LIB UUID.LIB ODBC32.LIB ODBCCP32.LIB /MANIFEST /MANIFESTUAC:"level='asInvoker' uiAccess='false'" /manifest:embed /DEBUG:FASTLINK /PDB:"D:\USER-PC\DESKTOP\FILL\DEBUG\FILL.PDB" /SUBSYSTEM:CONSOLE /TLBID:1 /DYNAMICBASE /NXCOMPAT /IMPLIB:"D:\USER-PC\DESKTOP\FILL\DEBUG\FILL.LIB" /MACHINE:X86 DEBUG\FILL.OBJ
^D:\USERS\USER-PC\SOURCE\REPOS\FILL\DEBUG\FILL.OBJ
/OUT:"D:\USERS\USER-PC\SOURCE\REPOS\FILL\DEBUG\FILL.EXE" /INCREMENTAL /NOLOGO KERNEL32.LIB USER32.LIB GDI32.LIB WINSPOOL.LIB COMDLG32.LIB ADVAPI32.LIB SHELL32.LIB OLE32.LIB OLEAUT32.LIB UUID.LIB ODBC32.LIB ODBCCP32.LIB /MANIFEST /MANIFESTUAC:"level='asInvoker' uiAccess='false'" /manifest:embed /DEBUG:FASTLINK /PDB:"D:\USERS\USER-PC\SOURCE\REPOS\FILL\DEBUG\FILL.PDB" /SUBSYSTEM:CONSOLE /TLBID:1 /DYNAMICBASE /NXCOMPAT /IMPLIB:"D:\USERS\USER-PC\SOURCE\REPOS\FILL\DEBUG\FILL.LIB" /MACHINE:X86 DEBUG\FILL.OBJ
^E:\FILL\DEBUG\FILL.OBJ
/OUT:"E:\FILL\DEBUG\FILL.EXE" /INCREMENTAL /NOLOGO KERNEL32.LIB USER32.LIB GDI32.LIB WINSPOOL.LIB COMDLG32.LIB ADVAPI32.LIB SHELL32.LIB OLE32.LIB OLEAUT32.LIB UUID.LIB ODBC32.LIB ODBCCP32.LIB /MANIFEST /MANIFESTUAC:"level='asInvoker' uiAccess='false'" /manifest:embed /DEBUG:FASTLINK /PDB:"E:\FILL\DEBUG\FILL.PDB" /SUBSYSTEM:CONSOLE /TLBID:1 /DYNAMICBASE /NXCOMPAT /IMPLIB:"E:\FILL\DEBUG\FILL.LIB" /MACHINE:X86 DEBUG\FILL.OBJ
^H:\FILL\DEBUG\FILL.OBJ
/OUT:"H:\FILL\DEBUG\FILL.EXE" /INCREMENTAL /NOLOGO KERNEL32.LIB USER32.LIB GDI32.LIB WINSPOOL.LIB COMDLG32.LIB ADVAPI32.LIB SHELL32.LIB OLE32.LIB OLEAUT32.LIB UUID.LIB ODBC32.LIB ODBCCP32.LIB /MANIFEST /MANIFESTUAC:"level='asInvoker' uiAccess='false'" /manifest:embed /DEBUG:FASTLINK /PDB:"H:\FILL\DEBUG\FILL.PDB" /SUBSYSTEM:CONSOLE /TLBID:1 /DYNAMICBASE /NXCOMPAT /IMPLIB:"H:\FILL\DEBUG\FILL.LIB" /MACHINE:X86 DEBUG\FILL.OBJ
