^C:\USERS\SANYA\ONEDRIVE\РАБОЧИЙ СТОЛ\MFC_CALCULATOR\MFC_CALCULATOR\MFCCALCULATOR.RC
C:\USERS\SANYA\ONEDRIVE\Рабочий стол\MFC_CALCULATOR\MFC_CALCULATOR\DEBUG\MFCCALCULATOR.RES
^E:\MFC_CALCULATOR\MFC_CALCULATOR\MFCCALCULATOR.RC
E:\MFC_CALCULATOR\MFC_CALCULATOR\DEBUG\MFCCALCULATOR.RES
