^C:\USERS\SANYA\ONEDRIVE\РАБОЧИЙ СТОЛ\MFC_CALCULATOR\MFC_CALCULATOR\PCH.CPP
C:\USERS\SANYA\ONEDRIVE\Рабочий стол\MFC_CALCULATOR\MFC_CALCULATOR\DEBUG\MFC_CALCULATOR.PCH
C:\USERS\SANYA\ONEDRIVE\Рабочий стол\MFC_CALCULATOR\MFC_CALCULATOR\DEBUG\VC142.PDB
C:\USERS\SANYA\ONEDRIVE\Рабочий стол\MFC_CALCULATOR\MFC_CALCULATOR\DEBUG\VC142.IDB
C:\USERS\SANYA\ONEDRIVE\Рабочий стол\MFC_CALCULATOR\MFC_CALCULATOR\DEBUG\PCH.OBJ
^C:\USERS\SANYA\ONEDRIVE\РАБОЧИЙ СТОЛ\MFC_CALCULATOR\MFC_CALCULATOR\MFC_CALCULATOR.CPP|C:\USERS\SANYA\ONEDRIVE\РАБОЧИЙ СТОЛ\MFC_CALCULATOR\MFC_CALCULATOR\MFC_CALCULATORDLG.CPP
C:\USERS\SANYA\ONEDRIVE\Рабочий стол\MFC_CALCULATOR\MFC_CALCULATOR\DEBUG\VC142.PDB
C:\USERS\SANYA\ONEDRIVE\Рабочий стол\MFC_CALCULATOR\MFC_CALCULATOR\DEBUG\VC142.IDB
C:\USERS\SANYA\ONEDRIVE\Рабочий стол\MFC_CALCULATOR\MFC_CALCULATOR\DEBUG\MFC_CALCULATORDLG.OBJ
C:\USERS\SANYA\ONEDRIVE\Рабочий стол\MFC_CALCULATOR\MFC_CALCULATOR\DEBUG\MFC_CALCULATOR.OBJ
^C:\USERS\SANYA\ONEDRIVE\РАБОЧИЙ СТОЛ\MFC_CALCULATOR\MFC_CALCULATOR\MFC_CALCULATOR.CPP
C:\USERS\SANYA\ONEDRIVE\РАБОЧИЙ СТОЛ\MFC_CALCULATOR\MFC_CALCULATOR\DEBUG\VC142.PDB
^C:\USERS\SANYA\ONEDRIVE\РАБОЧИЙ СТОЛ\MFC_CALCULATOR\MFC_CALCULATOR\MFC_CALCULATORDLG.CPP
C:\USERS\SANYA\ONEDRIVE\Рабочий стол\MFC_CALCULATOR\MFC_CALCULATOR\DEBUG\VC142.PDB
C:\USERS\SANYA\ONEDRIVE\Рабочий стол\MFC_CALCULATOR\MFC_CALCULATOR\DEBUG\VC142.IDB
C:\USERS\SANYA\ONEDRIVE\Рабочий стол\MFC_CALCULATOR\MFC_CALCULATOR\DEBUG\MFC_CALCULATORDLG.OBJ
^E:\MFC_CALCULATOR\MFC_CALCULATOR\PCH.CPP
E:\MFC_CALCULATOR\MFC_CALCULATOR\DEBUG\MFC_CALCULATOR.PCH
E:\MFC_CALCULATOR\MFC_CALCULATOR\DEBUG\VC142.PDB
E:\MFC_CALCULATOR\MFC_CALCULATOR\DEBUG\VC142.IDB
E:\MFC_CALCULATOR\MFC_CALCULATOR\DEBUG\PCH.OBJ
^E:\MFC_CALCULATOR\MFC_CALCULATOR\MFC_CALCULATOR.CPP|E:\MFC_CALCULATOR\MFC_CALCULATOR\MFC_CALCULATORDLG.CPP
E:\MFC_CALCULATOR\MFC_CALCULATOR\DEBUG\VC142.PDB
E:\MFC_CALCULATOR\MFC_CALCULATOR\DEBUG\VC142.IDB
E:\MFC_CALCULATOR\MFC_CALCULATOR\DEBUG\MFC_CALCULATORDLG.OBJ
E:\MFC_CALCULATOR\MFC_CALCULATOR\DEBUG\MFC_CALCULATOR.OBJ
^E:\MFC_CALCULATOR\MFC_CALCULATOR\MFC_CALCULATOR.CPP
E:\MFC_CALCULATOR\MFC_CALCULATOR\DEBUG\VC142.PDB
^E:\MFC_CALCULATOR\MFC_CALCULATOR\MFC_CALCULATORDLG.CPP
E:\MFC_CALCULATOR\MFC_CALCULATOR\DEBUG\VC142.PDB
