[
    {
        "nombre": "Casas TI",
        "tipo": "Aplicación Web",
        "fecha": "Oct 2020 - Nov 2020",
        "descripcion": "Aplicación web hecha en Ruby on Rails y PostgreSQL donde los alumnos de la carrera de ITC pueden registrar evidencias para generar puntos para sus casas.",
        "rol": "Migré parte de la interfaz gráfica de HTML embebido de Ruby on Rails a React e hice cambios en el diseño de la interfaz gráfica, mejorando la experiencia de usuario",
        "fotosURLs": [
            "./assets/Casas/home.png", 
            "./assets/Casas/perfil.png", 
            "./assets/Casas/casas.png",
            "./assets/Casas/admin.png" 
        ],
        "link": "https://saitcmty.com/"
    },
    {
        "nombre": "Mapachiona Halloween",
        "tipo": "Juego 2D",
        "fecha": "Oct 2020",
        "descripcion": "Juego 2D desarrollado en Godot donde eres un mapache y tienes que recolectar ropa de la basura, ya que se acerca Halloween, mientras te escabulles de las personas de la vecindad. Jugado 73 veces",
        "rol": "Desarrollé a los enemigos, las diferentes pantallas del juego y el flujo entre ellas.",
        "fotosURLs": [
            "./assets/Mapachiona/titlescreen.png", 
            "./assets/Mapachiona/village.png",
            "./assets/Mapachiona/win.png", 
            "./assets/Mapachiona/death.png", 
            "./assets/Mapachiona/trash.png" 
        ],
        "link": "https://alegayndra.itch.io/mapachiona-halloween"
    },
    {
        "nombre": "NonGenericShooter",
        "tipo": "Juego de disparos 3D",
        "fecha": "Julio 2020",
        "descripcion": "Juego de disparos en primera persona 3D first hecho con ThreeJS y CannonJS donde peleas contra peligrosos enemigos pasando por varios niveles hasta morir",
        "rol": "Implementé el movimiento del jugador, la generación aleatoria de niveles, la IA de los enemigos y las animaciones de los enemigos y jugador.",
        "fotosURLs": [
            "./assets/NGS/nongenericshooter.png", 
            "./assets/NGS/enemies ngs.png", 
            "./assets/NGS/game over ngs.png"
        ],
        "link": ""
    },
    {
        "nombre": "Simulador Física",
        "tipo": "Aplicación para Android",
        "fecha": "Marzo 2020 - Junio 2020",
        "descripcion": "Simulador de física hecho en LibGDX para los estudiantes de PrepaNet del tema de fuerzas rotacionales donde tienes una barra sobre la cual puedes poner diferentes cantidades de ladrillos y ver como se balancea esta misma. También tiene un pequeño examen donde el usuario pueda poner a pruebas su conocimiento.",
        "rol": "Desarrollé la simulación de la barra: dibujar todas las imágenes y hacerlas rotar correctamente, agarrar un bloque, colocarlo sobre la barra y hacer que esta rotara acorde al peso del bloque.",
        "fotosURLs": [
            "./assets/SimFisica/titlescreen.png", 
            "./assets/SimFisica/barra.png", 
            "./assets/SimFisica/quizz.png"
        ],
        "link": ""
    },
    {
        "nombre": "One Month Hack",
        "tipo": "Aplicación Web",
        "fecha": "Marzo 2020 - Mayo 2020",
        "descripcion": " Aplicación web hecha con NodeJS, MongoDB y HTML+CSS y Javascript nativo para el One Month Hack, un hackatón remoto organizado por la mesa directiva de la carrera de ITC del ITESM - Campus Monterrey",
        "rol": "Desarrollé una API RESTful para tener acceso a la base de datos e implementé las vistas de login/signup y de equipo.",
        "fotosURLs": [
            "./assets/OMH/landing.png", 
            "./assets/OMH/faq.png", 
            "./assets/OMH/login.png", 
            "./assets/OMH/team.png", 
            "./assets/OMH/teaminfo.png"
        ],
        "link": ""
    },
    {
        "nombre": "Planes de Estudio ITESM",
        "tipo": "Aplicación Web",
        "fecha": "Noviembre 2019 - Enero 2020",
        "descripcion": "Aplicación web hecha con Bootstrap y Javascript donde los estudiantes del ITESM pueden ver su plan de estudios en una tabla y tilizar diferentes colores para marcar las diferentes materias y así ver su progreso en la carrera que al mismo tiempo planear sus siguientes semestres. Usada por más de 750 personas.",
        "rol": "Automatice la creación de la tabla, botones para seleccionar la carrera y los colores usando JSONs.",
        "fotosURLs": [
            "./assets/Estudios/planes de estudio.png", 
            "./assets/Estudios/carrera estudios.png", 
            "./assets/Estudios/coloreado estudios.png"
        ],
        "link": "https://luispc111.github.io/PlanesDeEstudio"
    },
    {
        "nombre": "MatchdayPool",
        "tipo": "Aplicación Web",
        "fecha": "Octubre 2019 - Noviembre 2019",
        "descripcion": "Aplicación web desarrollada con NodeJS, MongoDB, Boostrap y Javascript donde puedes crear quinielas de diferentes deportes o cualquier otra cosa que gustes y compartirla con amigos y/u otros usuarios dentro de la plataforma",
        "rol": "Desarrollé la API para acceder a la base de datos y el modelo de la base de datos.",
        "fotosURLs": [
            "./assets/Matchday/matchday inicio.png", 
            "./assets/Matchday/pools matchday.png",
            "./assets/Matchday/login matchday.png", 
            "./assets/Matchday/create pool matchday.png", 
            "./assets/Matchday/profile matchday.png" 
        ],
        "link": "https://matchdaypool.herokuapp.com"
    },
    {
        "nombre": "Xochi’s Adventure",
        "tipo": "Juego de plataformas 2D",
        "fecha": "Abril 2019 - Mayo 2019",
        "descripcion": "Juego de plataformas 2D en Java donde el jugador tiene que recolectar ingredientes de diferentes platillos mexicanos, mientras evitas a los chiles malvados y picos en el mapa.",
        "rol": "Desarrollé la mayoría del juego, implementé una cámara que sigue al jugador y diseñe los niveles del juego.",
        "fotosURLs": [
            "./assets/Xochi/titlescreen.png", 
            "./assets/Xochi/historia.jpeg",
            "./assets/Xochi/mapa.jpeg", 
            "./assets/Xochi/cdmx.jpeg", 
            "./assets/Xochi/recetario.jpeg" 
        ],
        "link": ""
    }
]