[
  {
    "title": "Wat is party invitie?",
    "description": "Lorem ipsum dolor sit amet, consectetur adipiscing elit. Vivamus quis sagittis tortor. "
  },
  {
    "title": "Hoe kan ik een feest ticket boeken",
    "description": "Lorem ipsum dolor sit amet, consectetur adipiscing elit. Vivamus quis sagittis tortor. "
  }
]