<svg width="113" height="40" viewBox="0 0 113 40" fill="none" xmlns="http://www.w3.org/2000/svg">
<path fill-rule="evenodd" clip-rule="evenodd" d="M30.4081 22.215C29.8042 21.5477 28.9939 21.1409 28.1086 21.1409C27.5391 21.1409 27.0037 21.3117 26.5298 21.6045C25.8846 20.7745 24.9923 20.2213 23.99 20.099C23.9215 19.1469 23.8595 18.1946 23.8183 17.2426C23.791 16.575 23.8595 15.8998 24.3058 15.4034C24.601 15.0695 24.9097 14.7683 25.2395 14.4918C25.6442 14.1418 26.0767 13.8243 26.5298 13.5315C27.4633 12.9619 28.4723 12.6199 29.454 12.6443C27.9989 13.2955 26.6533 14.0767 25.5483 15.1022C26.6809 16.4694 28.9324 16.8845 30.3808 13.8975C30.7445 13.149 31.1426 12.4815 31.6712 11.9932C30.813 11.6515 29.9756 10.8783 28.8637 10.6748C26.0767 10.1703 24.6971 11.4807 24.8412 13.4419C24.855 13.5883 24.8824 13.7431 24.9165 13.8895C24.5048 14.2314 24.1135 14.6055 23.7636 15.0043C23.7498 13.8734 23.7772 12.7259 23.8527 11.57C23.9077 10.7156 23.99 10.032 23.9421 9.16117C23.9285 8.86804 23.9007 8.5752 23.8595 8.29039C23.9559 8.23326 24.045 8.16005 24.1273 8.08684C25.1984 7.06963 25.0679 5.34413 23.2144 3.66774C22.4867 3.00051 21.6152 2.84576 20.956 2.43864C21.0108 3.09008 20.9011 3.74899 20.7294 4.43258C20.0569 7.16724 21.5532 8.51003 22.885 8.53443C22.7751 7.16724 22.3976 5.77565 21.8966 4.36769C22.4661 5.05129 22.871 5.96284 23.1182 6.94761C23.2282 7.43568 23.3173 7.91601 23.3723 8.39604C23.3999 8.61596 23.4205 8.8356 23.4343 9.05523C23.5302 10.7319 22.988 13.9303 22.9947 16.1602C22.6378 15.7531 22.2397 15.3706 21.814 15.0207C21.8552 14.8742 21.876 14.7278 21.8895 14.5731C22.0404 12.6119 20.6608 11.3096 17.8671 11.8143C16.7619 12.0095 15.9177 12.7827 15.0596 13.1327C15.595 13.6127 15.9863 14.2883 16.3502 15.037C17.7983 18.0157 20.0499 17.6006 21.1895 16.2414C20.0775 15.2079 18.7321 14.4347 17.2837 13.7755C18.2584 13.7511 19.2672 14.1011 20.201 14.6627C20.6608 14.9558 21.0933 15.273 21.4982 15.623C21.7934 15.8754 22.0748 16.1438 22.3426 16.4367C22.9742 17.1286 23.0015 17.3646 23.0221 18.3249C23.0427 18.9109 23.0633 19.5049 23.0909 20.1073C22.4526 20.1969 21.8622 20.465 21.3541 20.8641C20.9628 20.5876 20.5097 20.4326 20.0223 20.4326C19.1234 20.4326 18.3272 20.9697 17.8533 21.792C19.3704 22.573 20.9287 23.1184 22.5485 23.5336C23.8321 23.8672 25.1226 24.1111 26.413 24.4123C26.7218 24.4857 27.0448 24.5995 27.3536 24.7787L27.7035 24.567C27.882 24.4614 28.0536 24.3472 28.2183 24.2253C29.001 23.6556 29.7148 22.9313 30.4081 22.215ZM22.3976 24.331C20.709 23.8917 18.9037 23.2894 17.0227 22.2393C13.0621 20.0257 9.08769 20.2457 5.95762 23.4276C5.07895 24.3229 4.57778 24.8031 3.47277 25.381L0.287736 27.041C-0.268377 27.3341 0.00632562 29.5151 0.898625 31.924C1.791 34.3249 2.9648 36.0341 3.52072 35.7493L8.6621 33.0554C9.78786 32.4694 11.3255 32.2008 13.1445 32.8113L18.835 34.7317C20.5923 35.3259 22.569 35.6188 24.1891 34.5936L30.1817 30.8009C32.1175 29.5801 32.7147 29.4663 33.8952 27.5132L36.9498 22.4673C37.808 21.051 36.9086 19.6109 35.7487 20.1073C35.1513 19.4317 34.4718 19.5293 33.7099 20.1234C31.5339 21.792 30.0582 24.0623 28.0127 25.2913C28.2321 25.5192 28.4038 25.796 28.5067 26.1133C29.2412 28.4085 26.6191 29.8894 25.0402 29.5801L19.8646 28.5386C18.5948 28.2862 17.3317 28.3432 16.1512 28.9291C15.7186 29.1489 15.5264 28.3513 15.9657 28.1399C17.215 27.5457 18.5604 27.456 19.9813 27.7409L22.3976 28.2212L25.157 28.7747C26.2622 28.9945 28.3694 27.9851 27.8616 26.4063C27.6899 25.8691 27.0928 25.3973 26.2828 25.21C25.0814 24.9332 23.7772 24.689 22.3976 24.331Z" fill="#0B0B0B"/>
<path d="M43.6829 39.5221L44.657 39.2832V29.0916L43.6829 28.8527V28.6139H48.3099V28.8527L47.3358 29.0916V34.0918L51.3134 29.3305L50.0958 28.8527V28.6139H53.1804V28.8527L51.8816 29.3305L49.0405 32.7542L53.424 39.2832L54.2357 39.5221V39.7609H51.9628C51.4757 39.7609 51.059 39.6441 50.7127 39.4106C50.3772 39.1664 50.0633 38.832 49.7711 38.4073L47.3358 34.7447V39.2832L48.3099 39.5221V39.7609H43.6829V39.5221Z" fill="#0B0B0B"/>
<path d="M60.2453 39.9998C59.1846 39.9998 58.2538 39.7768 57.4528 39.331C56.6627 38.8745 56.0512 38.2109 55.6183 37.3404C55.1853 36.4699 54.9688 35.4189 54.9688 34.1874C54.9688 32.9559 55.1853 31.9049 55.6183 31.0344C56.0512 30.1638 56.6627 29.5056 57.4528 29.0597C58.2538 28.6032 59.1846 28.375 60.2453 28.375C61.306 28.375 62.2314 28.6032 63.0215 29.0597C63.8224 29.5056 64.4394 30.1638 64.8723 31.0344C65.3052 31.9049 65.5217 32.9559 65.5217 34.1874C65.5217 35.4189 65.3052 36.4699 64.8723 37.3404C64.4394 38.2109 63.8224 38.8745 63.0215 39.331C62.2314 39.7768 61.306 39.9998 60.2453 39.9998ZM60.2453 39.6813C60.6674 39.6813 61.057 39.5061 61.4142 39.1558C61.7822 38.8055 62.0853 38.2216 62.3234 37.4041C62.5615 36.5867 62.6806 35.5144 62.6806 34.1874C62.6806 32.8604 62.5615 31.7881 62.3234 30.9707C62.0853 30.1532 61.7822 29.5693 61.4142 29.219C61.057 28.8687 60.6674 28.6935 60.2453 28.6935C59.8232 28.6935 59.4281 28.8687 59.0601 29.219C58.7029 29.5693 58.4053 30.1532 58.1672 30.9707C57.9291 31.7881 57.81 32.8604 57.81 34.1874C57.81 35.5144 57.9291 36.5867 58.1672 37.4041C58.4053 38.2216 58.7029 38.8055 59.0601 39.1558C59.4281 39.5061 59.8232 39.6813 60.2453 39.6813Z" fill="#0B0B0B"/>
<path d="M69.1784 31.321V39.0443L70.4772 39.5221V39.7609H67.3926V39.5221L68.6914 39.0443V29.1712L67.5549 28.8527V28.6139H69.2596C69.8332 28.6139 70.2824 28.7147 70.6071 28.9164C70.9318 29.1181 71.2403 29.3889 71.5325 29.7286L76.7278 35.7002V29.3305L75.429 28.8527V28.6139H78.5137V28.8527L77.2148 29.3305V39.9998H76.7278L69.1784 31.321Z" fill="#0B0B0B"/>
<path d="M78.7565 39.5221L80.0554 39.0443L84.52 28.4546H85.0071L89.6341 39.2832L90.4459 39.5221V39.7609H88.4977C87.9348 39.7609 87.4748 39.6388 87.1177 39.3947C86.7605 39.1399 86.4953 38.8108 86.3221 38.4073L85.4941 36.4964H81.6139L80.5424 39.0443L81.7601 39.5221V39.7609H78.7565V39.5221ZM81.7763 36.0983H85.3318L83.5459 31.9102L81.7763 36.0983Z" fill="#0B0B0B"/>
<path d="M91.5773 39.5221L92.5514 39.2832V29.0916L91.5773 28.8527V28.6139H100.263V31.4802H99.776C99.5704 31.321 99.3918 31.1193 99.2403 30.8751C98.8939 30.3018 98.7207 29.6808 98.7207 29.012H95.2302V34.0281H97.0972C97.173 33.6247 97.3137 33.2479 97.5193 32.8975C97.6059 32.7383 97.7087 32.5843 97.8278 32.4357H98.3149V36.0187H97.8278C97.7087 35.8701 97.6059 35.7161 97.5193 35.5569C97.3137 35.2066 97.173 34.8297 97.0972 34.4263H95.2302V39.3628H99.0454C99.0454 38.694 99.2186 38.0729 99.565 37.4997C99.7165 37.2555 99.8951 37.0538 100.101 36.8945H100.588V39.7609H91.5773V39.5221Z" fill="#0B0B0B"/>
<path d="M102.366 29.0916L101.554 28.8527V28.6139H103.503C104.065 28.6139 104.525 28.7413 104.882 28.996C105.24 29.2402 105.51 29.564 105.694 29.9674L108.568 36.385L111.214 29.3305L109.997 28.8527V28.6139H113V28.8527L111.701 29.3305L107.724 39.9202H107.237L102.366 29.0916Z" fill="#0B0B0B"/>
<path d="M52.1053 21.7965C50.6644 21.7965 49.3149 21.478 48.0567 20.841C47.4884 20.5623 47.0115 20.2339 46.626 19.8557C46.3418 20.3135 45.9867 20.7216 45.5605 21.0799C45.1952 21.3386 44.9923 21.478 44.9517 21.4979H44.1907V15.8248H45.4083C45.7127 16.8002 46.1389 17.676 46.6868 18.4524C47.9248 20.1841 49.528 21.05 51.4965 21.05C52.6533 21.05 53.5766 20.7116 54.2666 20.0348C54.9566 19.3581 55.3016 18.4524 55.3016 17.3177C55.3016 16.6609 55.0987 16.0737 54.6928 15.5561C54.3072 15.0386 53.8202 14.5807 53.2316 14.1826C52.6431 13.7845 51.8212 13.2869 50.7659 12.6897C49.4265 11.9532 48.3408 11.2864 47.5087 10.6892C46.6767 10.0921 45.9664 9.34561 45.3779 8.44986C44.7893 7.53421 44.4951 6.45932 44.4951 5.22518C44.4951 4.24981 44.7691 3.37397 45.317 2.59766C45.8852 1.80144 46.7274 1.17442 47.8436 0.716596C48.9598 0.238865 50.3296 0 51.9531 0C53.1302 0 54.3072 0.32844 55.4843 0.98532C55.9307 1.22419 56.3772 1.54267 56.8237 1.94078C57.1687 1.42324 57.5238 1.01518 57.8891 0.716596C58.2544 0.457824 58.4573 0.318486 58.4979 0.298581H59.2589V5.97163H58.0413C57.7775 5.01617 57.3818 4.15029 56.8541 3.37397C56.3671 2.61757 55.7582 1.99054 55.0277 1.49291C54.3174 0.995272 53.4955 0.746453 52.5619 0.746453C51.7705 0.746453 51.0906 1.05499 50.5224 1.67206C49.9542 2.28913 49.67 3.07539 49.67 4.03085C49.67 4.76735 49.8831 5.43419 50.3093 6.03135C50.7558 6.60861 51.2936 7.1162 51.9227 7.55412C52.5721 7.99204 53.4447 8.51953 54.5406 9.1366C55.8191 9.8532 56.8541 10.4902 57.6456 11.0475C58.437 11.6049 59.1067 12.3016 59.6547 13.1376C60.2026 13.9537 60.4766 14.8992 60.4766 15.9741C60.4766 17.049 60.162 18.0343 59.5329 18.9301C58.9038 19.8059 57.9601 20.5026 56.7019 21.0202C55.4437 21.5377 53.9115 21.7965 52.1053 21.7965Z" fill="#0B0B0B"/>
<path d="M67.6219 20.9007L69.4483 20.4529V1.34362L67.6219 0.895744V0.447872H76.1454C79.5142 0.447872 81.9291 0.995272 83.3903 2.09007C84.8515 3.16497 85.582 4.7574 85.582 6.86738C85.582 8.97736 84.8515 10.5797 83.3903 11.6745C81.9291 12.7494 79.5142 13.2869 76.1454 13.2869H74.4711V20.4529L76.2976 20.9007V21.3486H67.6219V20.9007ZM76.1454 12.5404C77.4239 12.5404 78.4487 12.0627 79.2199 11.1072C80.0114 10.1518 80.4071 8.73849 80.4071 6.86738C80.4071 5.01617 80.0114 3.61284 79.2199 2.65738C78.4487 1.68201 77.4239 1.19433 76.1454 1.19433H74.4711V12.5404H76.1454Z" fill="#0B0B0B"/>
<path d="M93.0341 20.9007L94.8606 20.4529V1.34362L93.0341 0.895744V0.447872H101.71V0.895744L99.8833 1.34362V10.7191L107.341 1.79149L105.058 0.895744V0.447872H110.842V0.895744L108.407 1.79149L103.08 8.211L111.299 20.4529L112.821 20.9007V21.3486H108.559C107.646 21.3486 106.864 21.1296 106.215 20.6917C105.586 20.2339 104.997 19.6069 104.449 18.8107L99.8833 11.9433V20.4529L101.71 20.9007V21.3486H93.0341V20.9007Z" fill="#0B0B0B"/>
</svg>
