а
алгоритм
алгоритм
баз
в
возника
выделен
для
зада
задач
и
из
использ
исходн
мартин
нахожден
не
обработк
одн
окончан
опубликова
осн
основ
основ
отсечен
портер
портер
последовательн
прав
примен
процесс
работа
ряд
слов
слов
слов
слов
стеммер
стемминг
суффикс
текст
част
эт