агентств
алепп
бедств
бол
в
в
в
в
в
в
виц
возросл
врем
государствен
дан
до
друг
ег
жертв
землетрясен
землетрясен
землетрясен
и
и
и
идлиб
информацион
команд
команд
кост
латак
меньш
меньш
меньш
меньш
мер
мер
мер
мер
мест
москв
на
на
настоя
обруш
окта
операц
по
по
по
по
по
по
погибл
погибл
погибш
подконтрольн
поисков
получ
помощ
пошел
пошл
правительств
президент
присла
провинц
провод
разрушительн
ран
ранен
результат
результат
сир
сир
сирийск
слов
снующ
сообщ
сообщ
сообща
спасател
спасательн
стал
сто
сто
стоя
стоя
стран
стран
тартус
телекана
телекана
турц
турц
феврал
фуат
хам
человек
человек
человек
человек
числ
что
что