-------------------------------------------------------------------------------
Test set: com.sprinklr.botintern.ApplicationTests
-------------------------------------------------------------------------------
Tests run: 1, Failures: 0, Errors: 0, Skipped: 0, Time elapsed: 1.989 s - in com.sprinklr.botintern.ApplicationTests
